==> Synchronizing chroot copy [/home/alhp/workspace/chroot/root] -> [build_b3a82094-be09-4d9f-b21a-b92bdda457eb]...done
==> Making package: sentry-native 0.17.1-1.1 (Fri Sep 25 13:52:38 2026)
==> Retrieving sources...
  -> Cloning sentry-native git repo...
Cloning into bare repository '/home/alhp/workspace/build/x86-64-v2/sentry-native-0.17.1-1/sentry-native'...
  -> Cloning sentry-native-libunwindstack-ndk git repo...
Cloning into bare repository '/home/alhp/workspace/build/x86-64-v2/sentry-native-0.17.1-1/sentry-native-libunwindstack-ndk'...
  -> Cloning sentry-native-breakpad git repo...
Cloning into bare repository '/home/alhp/workspace/build/x86-64-v2/sentry-native-0.17.1-1/sentry-native-breakpad'...
  -> Cloning sentry-native-chromium-linux-syscall-support git repo...
Cloning into bare repository '/home/alhp/workspace/build/x86-64-v2/sentry-native-0.17.1-1/sentry-native-chromium-linux-syscall-support'...
  -> Cloning sentry-native-crashpad git repo...
Cloning into bare repository '/home/alhp/workspace/build/x86-64-v2/sentry-native-0.17.1-1/sentry-native-crashpad'...
  -> Cloning sentry-native-mini_chromium git repo...
Cloning into bare repository '/home/alhp/workspace/build/x86-64-v2/sentry-native-0.17.1-1/sentry-native-mini_chromium'...
  -> Cloning sentry-native-chromium-zlib git repo...
Cloning into bare repository '/home/alhp/workspace/build/x86-64-v2/sentry-native-0.17.1-1/sentry-native-chromium-zlib'...
==> Validating source files with b2sums...
    sentry-native ... Passed
    sentry-native-libunwindstack-ndk ... Skipped
    sentry-native-breakpad ... Skipped
    sentry-native-chromium-linux-syscall-support ... Skipped
    sentry-native-crashpad ... Skipped
    sentry-native-mini_chromium ... Skipped
    sentry-native-chromium-zlib ... Skipped
Note: in a future version of systemd-nspawn the default set of permitted socket address families will be restricted to AF_INET, AF_INET6 and AF_UNIX. Use --restrict-address-families= to configure the set of permitted socket address families, or set RestrictAddressFamilies= in a .nspawn file.
==> Making package: sentry-native 0.17.1-1.1 (Fri Sep 25 11:53:21 2026)
==> Checking runtime dependencies...
==> Checking buildtime dependencies...
==> Installing missing dependencies...
resolving dependencies...
looking for conflicting packages...

Package (32)                     New Version       Net Change

extra/cppdap                     1.58.0-3            1.61 MiB
extra/dotnet-host                10.0.12.sdk112-1    0.48 MiB
extra/dotnet-runtime             10.0.12.sdk112-1   73.59 MiB
extra/dotnet-targeting-pack      10.0.12.sdk112-1   50.88 MiB
extra/hicolor-icon-theme         0.18-1              0.05 MiB
extra/jsoncpp                    1.9.8-1             0.86 MiB
extra/libunwind                  1.8.3-1             0.30 MiB
extra/libuv                      1.52.1-2            0.64 MiB
extra/perl-error                 0.17030-3           0.04 MiB
extra/perl-mailtools             2.22-3              0.10 MiB
extra/perl-timedate              2.35-1              0.15 MiB
extra/python-certifi             2026.07.22-1        0.02 MiB
extra/python-charset-normalizer  3.5.1-1             0.63 MiB
extra/python-idna                3.20-1              0.68 MiB
extra/python-iniconfig           2.3.0-1             0.07 MiB
extra/python-markupsafe          3.0.3-1             0.09 MiB
extra/python-packaging           26.3-1              1.58 MiB
extra/python-pluggy              1.6.0-3             0.23 MiB
extra/python-pygments            2.21.0-1           15.59 MiB
extra/python-urllib3             2.7.0-1             1.43 MiB
extra/python-werkzeug            3.1.8-1             2.75 MiB
extra/rhash                      1.4.6-1             0.34 MiB
extra/zlib-ng                    2.3.3-1             0.28 MiB
extra/cmake                      4.4.3-2           101.44 MiB
extra/dotnet-sdk                 10.0.12.sdk112-1  357.96 MiB
extra/git                        2.55.0-1           31.33 MiB
extra/python-flaky               3.8.1-4             0.15 MiB
extra/python-msgpack             1.1.2-2             0.31 MiB
extra/python-psutil              7.2.2-1             1.14 MiB
extra/python-pytest              1:9.1.1-1           4.95 MiB
extra/python-pytest-httpserver   1.1.5-1             0.31 MiB
extra/python-requests            2.34.2-1            0.76 MiB

Total Installed Size:  650.74 MiB

:: Proceed with installation? [Y/n] 
checking keyring...
checking package integrity...
loading package files...
checking for file conflicts...
:: Processing package changes...
installing cppdap...
installing hicolor-icon-theme...
installing jsoncpp...
Optional dependencies for jsoncpp
    jsoncpp-doc: documentation
installing libuv...
installing rhash...
installing cmake...
Optional dependencies for cmake
    make: for unix Makefile generator [installed]
    ninja: for ninja generator
    qt6-base: cmake-gui
installing perl-error...
installing perl-timedate...
installing perl-mailtools...
installing zlib-ng...
installing git...
Optional dependencies for git
    git-zsh-completion: upstream zsh completion
    tk: gitk and git gui
    openssh: ssh transport and crypto
    man: show help with `git command --help`
    perl-libwww: git svn
    perl-term-readkey: git svn and interactive.singlekey setting
    perl-io-socket-ssl: git send-email TLS support
    perl-authen-sasl: git send-email TLS support
    perl-cgi: gitweb (web interface) support
    python: git svn & git p4 [installed]
    subversion: git svn
    org.freedesktop.secrets: keyring credential helper
    libsecret: libsecret credential helper [installed]
    less: the default pager for git
installing dotnet-host...
Optional dependencies for dotnet-host
    bash-completion: Bash completion support
installing libunwind...
installing dotnet-runtime...
Optional dependencies for dotnet-runtime
    lttng-ust2.12: CoreCLR tracing
installing dotnet-targeting-pack...
Optional dependencies for dotnet-targeting-pack
    bash-completion: Bash completion support
installing dotnet-sdk...
Optional dependencies for dotnet-sdk
    aspnet-targeting-pack: Build ASP.NET Core applications
installing python-flaky...
installing python-msgpack...
installing python-psutil...
installing python-iniconfig...
installing python-packaging...
installing python-pluggy...
installing python-pygments...
installing python-pytest...
installing python-markupsafe...
installing python-werkzeug...
Optional dependencies for python-werkzeug
    python-watchdog: faster and more advanced reloader
installing python-pytest-httpserver...
installing python-charset-normalizer...
installing python-idna...
installing python-urllib3...
Optional dependencies for python-urllib3
    python-brotli: Brotli support
    python-brotlicffi: Brotli support
    python-h2: HTTP/2 support
    python-pysocks: SOCKS support
installing python-certifi...
installing python-requests...
Optional dependencies for python-requests
    python-chardet: alternative character encoding library
    python-pysocks: SOCKS proxy support
:: Running post-transaction hooks...
(1/3) Creating system user accounts...
Creating group 'git' with GID 969.
Creating user 'git' (git daemon user) with UID 969 and GID 969.
(2/3) Reloading system manager configuration...
  Skipped: Current root is not booted.
(3/3) Arming ConditionNeedsUpdate...
==> Retrieving sources...
==> WARNING: Skipping all source file integrity checks.
==> Extracting sources...
  -> Creating working copy of sentry-native git repo...
Cloning into 'sentry-native'...
done.
Updating files:   9% (81/878)Updating files:  10% (88/878)Updating files:  11% (97/878)Updating files:  12% (106/878)Updating files:  13% (115/878)Updating files:  14% (123/878)Updating files:  15% (132/878)Updating files:  16% (141/878)Updating files:  17% (150/878)Updating files:  18% (159/878)Updating files:  19% (167/878)Updating files:  20% (176/878)Updating files:  21% (185/878)Updating files:  22% (194/878)Updating files:  23% (202/878)Updating files:  24% (211/878)Updating files:  24% (214/878)Updating files:  25% (220/878)Updating files:  26% (229/878)Updating files:  27% (238/878)Updating files:  28% (246/878)Updating files:  29% (255/878)Updating files:  30% (264/878)Updating files:  31% (273/878)Updating files:  32% (281/878)Updating files:  33% (290/878)Updating files:  34% (299/878)Updating files:  35% (308/878)Updating files:  36% (317/878)Updating files:  37% (325/878)Updating files:  38% (334/878)Updating files:  39% (343/878)Updating files:  40% (352/878)Updating files:  41% (360/878)Updating files:  42% (369/878)Updating files:  43% (378/878)Updating files:  44% (387/878)Updating files:  45% (396/878)Updating files:  46% (404/878)Updating files:  47% (413/878)Updating files:  48% (422/878)Updating files:  49% (431/878)Updating files:  50% (439/878)Updating files:  51% (448/878)Updating files:  52% (457/878)Updating files:  53% (466/878)Updating files:  53% (474/878)Updating files:  54% (475/878)Updating files:  55% (483/878)Updating files:  56% (492/878)Updating files:  57% (501/878)Updating files:  58% (510/878)Updating files:  59% (519/878)Updating files:  60% (527/878)Updating files:  61% (536/878)Updating files:  62% (545/878)Updating files:  63% (554/878)Updating files:  64% (562/878)Updating files:  65% (571/878)Updating files:  66% (580/878)Updating files:  67% (589/878)Updating files:  68% (598/878)Updating files:  69% (606/878)Updating files:  70% (615/878)Updating files:  71% (624/878)Updating files:  72% (633/878)Updating files:  73% (641/878)Updating files:  74% (650/878)Updating files:  75% (659/878)Updating files:  76% (668/878)Updating files:  77% (677/878)Updating files:  78% (685/878)Updating files:  79% (694/878)Updating files:  80% (703/878)Updating files:  81% (712/878)Updating files:  82% (720/878)Updating files:  83% (729/878)Updating files:  84% (738/878)Updating files:  85% (747/878)Updating files:  86% (756/878)Updating files:  87% (764/878)Updating files:  88% (773/878)Updating files:  89% (782/878)Updating files:  90% (791/878)Updating files:  91% (799/878)Updating files:  92% (808/878)Updating files:  93% (817/878)Updating files:  94% (826/878)Updating files:  95% (835/878)Updating files:  96% (843/878)Updating files:  97% (852/878)Updating files:  98% (861/878)Updating files:  99% (870/878)Updating files: 100% (878/878)Updating files: 100% (878/878), done.
Switched to a new branch 'makepkg'
  -> Creating working copy of sentry-native-libunwindstack-ndk git repo...
Cloning into 'sentry-native-libunwindstack-ndk'...
done.
  -> Creating working copy of sentry-native-breakpad git repo...
Cloning into 'sentry-native-breakpad'...
done.
Updating files:  40% (380/927)Updating files:  41% (381/927)Updating files:  42% (390/927)Updating files:  43% (399/927)Updating files:  44% (408/927)Updating files:  45% (418/927)Updating files:  46% (427/927)Updating files:  47% (436/927)Updating files:  48% (445/927)Updating files:  49% (455/927)Updating files:  50% (464/927)Updating files:  51% (473/927)Updating files:  52% (483/927)Updating files:  53% (492/927)Updating files:  54% (501/927)Updating files:  55% (510/927)Updating files:  56% (520/927)Updating files:  57% (529/927)Updating files:  58% (538/927)Updating files:  59% (547/927)Updating files:  60% (557/927)Updating files:  61% (566/927)Updating files:  62% (575/927)Updating files:  63% (585/927)Updating files:  64% (594/927)Updating files:  65% (603/927)Updating files:  66% (612/927)Updating files:  67% (622/927)Updating files:  68% (631/927)Updating files:  69% (640/927)Updating files:  70% (649/927)Updating files:  71% (659/927)Updating files:  72% (668/927)Updating files:  73% (677/927)Updating files:  74% (686/927)Updating files:  75% (696/927)Updating files:  76% (705/927)Updating files:  77% (714/927)Updating files:  78% (724/927)Updating files:  79% (733/927)Updating files:  80% (742/927)Updating files:  80% (745/927)Updating files:  81% (751/927)Updating files:  82% (761/927)Updating files:  83% (770/927)Updating files:  84% (779/927)Updating files:  85% (788/927)Updating files:  86% (798/927)Updating files:  87% (807/927)Updating files:  88% (816/927)Updating files:  88% (822/927)Updating files:  89% (826/927)Updating files:  90% (835/927)Updating files:  91% (844/927)Updating files:  92% (853/927)Updating files:  93% (863/927)Updating files:  94% (872/927)Updating files:  95% (881/927)Updating files:  96% (890/927)Updating files:  97% (900/927)Updating files:  98% (909/927)Updating files:  99% (918/927)Updating files: 100% (927/927)Updating files: 100% (927/927), done.
  -> Creating working copy of sentry-native-chromium-linux-syscall-support git repo...
Cloning into 'sentry-native-chromium-linux-syscall-support'...
done.
  -> Creating working copy of sentry-native-crashpad git repo...
Cloning into 'sentry-native-crashpad'...
done.
  -> Creating working copy of sentry-native-mini_chromium git repo...
Cloning into 'sentry-native-mini_chromium'...
done.
  -> Creating working copy of sentry-native-chromium-zlib git repo...
Cloning into 'sentry-native-chromium-zlib'...
done.
==> Starting prepare()...
Submodule 'external/benchmark' (https://github.com/google/benchmark.git) registered for path 'external/benchmark'
Submodule 'external/breakpad' (https://github.com/getsentry/breakpad.git) registered for path 'external/breakpad'
Submodule 'external/crashpad' (https://github.com/getsentry/crashpad.git) registered for path 'external/crashpad'
Submodule 'external/libunwindstack-ndk' (https://github.com/getsentry/libunwindstack-ndk) registered for path 'external/libunwindstack-ndk'
Submodule 'external/third_party/lss' (https://github.com/getsentry/chromium-linux-syscall-support) registered for path 'external/third_party/lss'
Cloning into '/startdir/src/sentry-native/external/benchmark'...
Cloning into '/startdir/src/sentry-native/external/breakpad'...
done.
Cloning into '/startdir/src/sentry-native/external/crashpad'...
done.
Cloning into '/startdir/src/sentry-native/external/libunwindstack-ndk'...
done.
Cloning into '/startdir/src/sentry-native/external/third_party/lss'...
done.
Submodule path 'external/benchmark': checked out '48f5cc21bac647a8a64e9787cb84f349e334b7ac'
Submodule path 'external/breakpad': checked out '25b6b727af49fa383161e7dba4a82ab0661b69b8'
Submodule path 'external/crashpad': checked out '000e3ad7a51c89e49bc00eca9846aa0485cccc96'
Submodule path 'external/libunwindstack-ndk': checked out '284202fb1e42dbeba6598e26ced2e1ec404eecd1'
Submodule path 'external/third_party/lss': checked out 'ed31caa60f20a4f6569883b2d752ef7522de51e0'
Submodule 'third_party/lss/lss' (https://github.com/getsentry/chromium-linux-syscall-support) registered for path 'third_party/lss/lss'
Submodule 'third_party/mini_chromium/mini_chromium' (https://github.com/getsentry/mini_chromium.git) registered for path 'third_party/mini_chromium/mini_chromium'
Submodule 'third_party/zlib/zlib' (https://github.com/getsentry/chromium-zlib) registered for path 'third_party/zlib/zlib'
Cloning into '/startdir/src/sentry-native/external/crashpad/third_party/lss/lss'...
done.
Cloning into '/startdir/src/sentry-native/external/crashpad/third_party/mini_chromium/mini_chromium'...
done.
Cloning into '/startdir/src/sentry-native/external/crashpad/third_party/zlib/zlib'...
done.
Submodule path 'third_party/lss/lss': checked out '9719c1e1e676814c456b55f5f070eabad6709d31'
Submodule path 'third_party/mini_chromium/mini_chromium': checked out '2f5c168fa462cf3836c4a7801b4f4955496d975d'
Submodule path 'third_party/zlib/zlib': checked out 'fef58692c1d7bec94c4ed3d030a45a1832a9615d'
==> Starting build()...
The no-dev option is deprecated.  Use -Wno-author instead.
-- Sentry SDK version (full): 0.17.1
-- Sentry SDK version (base): 0.17.1
-- Sentry SDK version major='0' minor='17' patch='1'
-- The C compiler identification is GNU 16.2.1
-- The CXX compiler identification is GNU 16.2.1
-- Detecting C compiler ABI info
-- Detecting C compiler ABI info - done
-- Check for working C compiler: /usr/bin/cc - skipped
-- Detecting C compile features
-- Detecting C compile features - done
-- Detecting CXX compiler ABI info
-- Detecting CXX compiler ABI info - done
-- Check for working CXX compiler: /usr/bin/c++ - skipped
-- Detecting CXX compile features
-- Detecting CXX compile features - done
-- Performing Test CMAKE_HAVE_LIBC_PTHREAD
-- Performing Test CMAKE_HAVE_LIBC_PTHREAD - Success
-- Found Threads: TRUE
-- SENTRY_TRANSPORT=curl
-- SENTRY_BACKEND=crashpad
-- SENTRY_LIBRARY_TYPE=SHARED
-- SENTRY_SDK_NAME=
-- SENTRY_INTEGRATION_PLATFORM=OFF
-- SENTRY_HANDLER_STACK_SIZE=64
-- SENTRY_BATCHER_BUFFER_COUNT=3
-- Looking for sys/types.h
-- Looking for sys/types.h - found
-- Looking for stdint.h
-- Looking for stdint.h - found
-- Looking for stddef.h
-- Looking for stddef.h - found
-- Check size of long
-- Check size of long - done
-- Looking for copy_file_range
-- Looking for copy_file_range - found
-- Found CURL: /usr/lib/libcurl.so (found version "8.22.0")
-- Performing Test SENTRY_HAVE_ATOMIC_U64
-- Performing Test SENTRY_HAVE_ATOMIC_U64 - Success
-- Looking for a ASM compiler
-- Looking for a ASM compiler - /usr/bin/cc
-- The ASM compiler identification is GNU
-- Found assembler: /usr/bin/cc
-- Looking for asm/ptrace.h
-- Looking for asm/ptrace.h - found
-- Looking for byteswap.h
-- Looking for byteswap.h - found
-- Looking for elf.h
-- Looking for elf.h - found
-- Looking for endian.h
-- Looking for endian.h - found
-- Looking for execinfo.h
-- Looking for execinfo.h - found
-- Looking for link.h
-- Looking for link.h - found
-- Looking for signal.h
-- Looking for signal.h - found
-- Looking for sys/ptrace.h
-- Looking for sys/ptrace.h - found
-- Looking for sys/syscall.h
-- Looking for sys/syscall.h - found
-- Looking for sys/stat.h
-- Looking for sys/stat.h - found
-- Looking for sys/param.h
-- Looking for sys/param.h - found
-- Looking for sys/procfs.h
-- Looking for sys/procfs.h - found
-- Looking for dl_iterate_phdr
-- Looking for dl_iterate_phdr - found
-- Looking for mincore
-- Looking for mincore - found
-- Looking for pipe2
-- Looking for pipe2 - found
-- Looking for sigaltstack
-- Looking for sigaltstack - found
-- Performing Test HAVE_STRUCT_DL_PHDR_INFO_DLPI_SUBS
-- Performing Test HAVE_STRUCT_DL_PHDR_INFO_DLPI_SUBS - Success
-- Performing Test HAVE_DECL_PTRACE_CONT_VAL
-- Performing Test HAVE_DECL_PTRACE_CONT_VAL - Success
-- Performing Test HAVE_DECL_PTRACE_POKEDATA_VAL
-- Performing Test HAVE_DECL_PTRACE_POKEDATA_VAL - Success
-- Performing Test HAVE_DECL_PTRACE_POKEUSER_VAL
-- Performing Test HAVE_DECL_PTRACE_POKEUSER_VAL - Success
-- Performing Test HAVE_DECL_PTRACE_SETREGSET_VAL
-- Performing Test HAVE_DECL_PTRACE_SETREGSET_VAL - Success
-- Performing Test HAVE_DECL_PTRACE_SINGLESTEP_VAL
-- Performing Test HAVE_DECL_PTRACE_SINGLESTEP_VAL - Success
-- Performing Test HAVE_DECL_PTRACE_SYSCALL_VAL
-- Performing Test HAVE_DECL_PTRACE_SYSCALL_VAL - Success
-- Performing Test HAVE_DECL_PTRACE_TRACEME_VAL
-- Performing Test HAVE_DECL_PTRACE_TRACEME_VAL - Success
-- Performing Test HAVE_DECL_PT_CONTINUE_VAL
-- Performing Test HAVE_DECL_PT_CONTINUE_VAL - Success
-- Performing Test HAVE_DECL_PT_GETFPREGS_VAL
-- Performing Test HAVE_DECL_PT_GETFPREGS_VAL - Success
-- Performing Test HAVE_DECL_PT_GETREGS_VAL
-- Performing Test HAVE_DECL_PT_GETREGS_VAL - Success
-- Performing Test HAVE_DECL_PT_IO_VAL
-- Performing Test HAVE_DECL_PT_IO_VAL - Failed
-- Performing Test HAVE_DECL_PT_STEP_VAL
-- Performing Test HAVE_DECL_PT_STEP_VAL - Success
-- Performing Test HAVE_DECL_PT_SYSCALL_VAL
-- Performing Test HAVE_DECL_PT_SYSCALL_VAL - Success
-- Performing Test HAVE_DECL_PT_TRACE_ME_VAL
-- Performing Test HAVE_DECL_PT_TRACE_ME_VAL - Success
-- Found ZLIB: /usr/lib/libz.so (found version "1.3.2")
-- Configuring done (7.9s)
-- Generating done (3.6s)
-- Build files have been written to: /startdir/src/sentry-native/build
[  0%] Building CXX object crashpad_build/third_party/mpack/CMakeFiles/crashpad_mpack.dir/mpack.cc.o
[  0%] Building CXX object crashpad_build/tools/CMakeFiles/crashpad_tools.dir/tool_support.cc.o
[  0%] Building CXX object crashpad_build/compat/CMakeFiles/crashpad_compat.dir/linux/sys/mman_memfd_create.cc.o
[  1%] Building CXX object crashpad_build/third_party/mini_chromium/CMakeFiles/mini_chromium.dir/mini_chromium/base/process/memory.cc.o
[  2%] Building CXX object crashpad_build/third_party/mini_chromium/CMakeFiles/mini_chromium.dir/mini_chromium/base/strings/pattern.cc.o
[  2%] Building CXX object crashpad_build/third_party/mini_chromium/CMakeFiles/mini_chromium.dir/mini_chromium/base/strings/strcat.cc.o
[  3%] Building CXX object crashpad_build/third_party/mini_chromium/CMakeFiles/mini_chromium.dir/mini_chromium/base/synchronization/lock.cc.o
[  3%] Building CXX object crashpad_build/third_party/mini_chromium/CMakeFiles/mini_chromium.dir/mini_chromium/base/strings/stringprintf.cc.o
[  1%] Building CXX object crashpad_build/third_party/mini_chromium/CMakeFiles/mini_chromium.dir/mini_chromium/base/files/file_util_posix.cc.o
[  3%] Building CXX object crashpad_build/third_party/mini_chromium/CMakeFiles/mini_chromium.dir/mini_chromium/base/memory/page_size_posix.cc.o
[  2%] Building CXX object crashpad_build/third_party/mini_chromium/CMakeFiles/mini_chromium.dir/mini_chromium/base/strings/string_number_conversions.cc.o
[  3%] Building CXX object crashpad_build/third_party/mini_chromium/CMakeFiles/mini_chromium.dir/mini_chromium/base/third_party/icu/icu_utf.cc.o
[  3%] Building C object vendor/libunwind/CMakeFiles/unwind.dir/src/mi/init.c.o
[  1%] Building CXX object crashpad_build/third_party/mini_chromium/CMakeFiles/mini_chromium.dir/mini_chromium/base/files/file_util.cc.o
[  3%] Building C object vendor/libunwind/CMakeFiles/unwind.dir/src/dl-iterate-phdr.c.o
[  1%] Building CXX object crashpad_build/third_party/mini_chromium/CMakeFiles/mini_chromium.dir/mini_chromium/base/debug/alias.cc.o
[  1%] Building CXX object crashpad_build/third_party/mini_chromium/CMakeFiles/mini_chromium.dir/mini_chromium/base/logging.cc.o
[  1%] Building CXX object crashpad_build/third_party/mini_chromium/CMakeFiles/mini_chromium.dir/mini_chromium/base/files/scoped_file.cc.o
[  1%] Building CXX object crashpad_build/third_party/mini_chromium/CMakeFiles/mini_chromium.dir/mini_chromium/base/rand_util.cc.o
[  2%] Building C object vendor/libunwind/CMakeFiles/unwind.dir/src/os-linux.c.o
[  2%] Building CXX object crashpad_build/third_party/mini_chromium/CMakeFiles/mini_chromium.dir/mini_chromium/base/strings/utf_string_conversions.cc.o
[  4%] Building CXX object crashpad_build/third_party/mini_chromium/CMakeFiles/mini_chromium.dir/mini_chromium/base/files/file_path.cc.o
[  3%] Building CXX object crashpad_build/third_party/mini_chromium/CMakeFiles/mini_chromium.dir/mini_chromium/base/threading/thread_local_storage.cc.o
[  4%] Building CXX object crashpad_build/third_party/mini_chromium/CMakeFiles/mini_chromium.dir/mini_chromium/base/strings/utf_string_conversion_utils.cc.o
[  4%] Building CXX object crashpad_build/third_party/mini_chromium/CMakeFiles/mini_chromium.dir/mini_chromium/base/posix/safe_strerror.cc.o
[  5%] Building CXX object crashpad_build/third_party/mini_chromium/CMakeFiles/mini_chromium.dir/mini_chromium/base/synchronization/condition_variable_posix.cc.o
[  5%] Building CXX object crashpad_build/third_party/mini_chromium/CMakeFiles/mini_chromium.dir/mini_chromium/base/synchronization/lock_impl_posix.cc.o
[  5%] Building C object vendor/libunwind/CMakeFiles/unwind.dir/src/mi/flush_cache.c.o
[  5%] Building CXX object crashpad_build/third_party/mini_chromium/CMakeFiles/mini_chromium.dir/mini_chromium/base/threading/thread_local_storage_posix.cc.o
[  5%] Linking CXX static library libcrashpad_compat.a
[  6%] Building C object vendor/libunwind/CMakeFiles/unwind.dir/src/mi/mempool.c.o
[  6%] Building C object vendor/libunwind/CMakeFiles/unwind.dir/src/mi/strerror.c.o
[  6%] Built target crashpad_compat
[  6%] Building C object vendor/libunwind/CMakeFiles/unwind.dir/src/mi/dyn-cancel.c.o
[  6%] Building C object vendor/libunwind/CMakeFiles/unwind.dir/src/mi/backtrace.c.o
[  6%] Building C object vendor/libunwind/CMakeFiles/unwind.dir/src/mi/dyn-info-list.c.o
[  7%] Building C object vendor/libunwind/CMakeFiles/unwind.dir/src/mi/dyn-register.c.o
[  7%] Building C object vendor/libunwind/CMakeFiles/unwind.dir/src/mi/Laddress_validator.c.o
[  7%] Building C object vendor/libunwind/CMakeFiles/unwind.dir/src/mi/Ldestroy_addr_space.c.o
[  7%] Building C object vendor/libunwind/CMakeFiles/unwind.dir/src/mi/Ldyn-extract.c.o
[  7%] Linking CXX static library libcrashpad_mpack.a
[  8%] Building C object vendor/libunwind/CMakeFiles/unwind.dir/src/mi/Lfind_dynamic_proc_info.c.o
[  8%] Linking CXX static library libcrashpad_tools.a
[  8%] Building C object vendor/libunwind/CMakeFiles/unwind.dir/src/mi/Lget_accessors.c.o
[  8%] Building C object vendor/libunwind/CMakeFiles/unwind.dir/src/mi/Lget_fpreg.c.o
[  8%] Built target crashpad_mpack
[  8%] Building C object vendor/libunwind/CMakeFiles/unwind.dir/src/mi/Lset_fpreg.c.o
[  8%] Building C object vendor/libunwind/CMakeFiles/unwind.dir/src/mi/Lget_proc_info_by_ip.c.o
[  9%] Building C object vendor/libunwind/CMakeFiles/unwind.dir/src/mi/Lget_proc_name.c.o
[  9%] Building C object vendor/libunwind/CMakeFiles/unwind.dir/src/mi/Lget_reg.c.o
[  9%] Building C object vendor/libunwind/CMakeFiles/unwind.dir/src/mi/Lis_plt_entry.c.o
[  9%] Building C object vendor/libunwind/CMakeFiles/unwind.dir/src/mi/Lput_dynamic_unwind_info.c.o
[  9%] Built target crashpad_tools
[  9%] Building C object vendor/libunwind/CMakeFiles/unwind.dir/src/mi/Lset_cache_size.c.o
[ 10%] Building C object vendor/libunwind/CMakeFiles/unwind.dir/src/mi/Lset_caching_policy.c.o
[ 10%] Building C object vendor/libunwind/CMakeFiles/unwind.dir/src/mi/Lset_iterate_phdr_function.c.o
[ 10%] Building C object vendor/libunwind/CMakeFiles/unwind.dir/src/mi/Lset_reg.c.o
[ 10%] Building C object vendor/libunwind/CMakeFiles/unwind.dir/src/mi/Lget_elf_filename.c.o
[ 11%] Building C object vendor/libunwind/CMakeFiles/unwind.dir/src/dwarf/Lexpr.c.o
[ 11%] Building C object vendor/libunwind/CMakeFiles/unwind.dir/src/dwarf/global.c.o
[ 11%] Building C object vendor/libunwind/CMakeFiles/unwind.dir/src/dwarf/Lfind_proc_info-lsb.c.o
[ 12%] Linking CXX static library libmini_chromium.a
[ 12%] Building C object vendor/libunwind/CMakeFiles/unwind.dir/src/elf64.c.o
[ 12%] Building C object vendor/libunwind/CMakeFiles/unwind.dir/src/dwarf/Lget_proc_info_in_range.c.o
[ 12%] Building C object vendor/libunwind/CMakeFiles/unwind.dir/src/x86_64/Los-linux.c.o
[ 11%] Building C object vendor/libunwind/CMakeFiles/unwind.dir/src/dwarf/Lfde.c.o
[ 12%] Building C object vendor/libunwind/CMakeFiles/unwind.dir/src/x86_64/is_fpreg.c.o
[ 12%] Building C object vendor/libunwind/CMakeFiles/unwind.dir/src/dwarf/Lparser.c.o
[ 11%] Building C object vendor/libunwind/CMakeFiles/unwind.dir/src/dwarf/Lfind_unwind_table.c.o
[ 12%] Building C object vendor/libunwind/CMakeFiles/unwind.dir/src/dwarf/Lpe.c.o
[ 13%] Building C object vendor/libunwind/CMakeFiles/unwind.dir/src/x86_64/Lapply_reg_state.c.o
[ 13%] Building C object vendor/libunwind/CMakeFiles/unwind.dir/src/x86_64/regname.c.o
[ 14%] Building C object vendor/libunwind/CMakeFiles/unwind.dir/src/x86_64/Lcreate_addr_space.c.o
[ 13%] Building ASM object vendor/libunwind/CMakeFiles/unwind.dir/src/x86_64/getcontext.S.o
[ 14%] Building C object vendor/libunwind/CMakeFiles/unwind.dir/src/x86_64/Lget_proc_info.c.o
[ 14%] Building C object vendor/libunwind/CMakeFiles/unwind.dir/src/x86_64/Lget_save_loc.c.o
[ 14%] Building C object vendor/libunwind/CMakeFiles/unwind.dir/src/x86_64/Lglobal.c.o
[ 14%] Built target mini_chromium
[ 14%] Building C object vendor/libunwind/CMakeFiles/unwind.dir/src/x86_64/Linit.c.o
[ 15%] Building C object vendor/libunwind/CMakeFiles/unwind.dir/src/x86_64/Linit_local.c.o
[ 15%] Building C object vendor/libunwind/CMakeFiles/unwind.dir/src/x86_64/Linit_remote.c.o
[ 16%] Building CXX object crashpad_build/util/CMakeFiles/crashpad_util.dir/file/delimited_file_reader.cc.o
[ 16%] Building CXX object crashpad_build/util/CMakeFiles/crashpad_util.dir/file/file_helper.cc.o
[ 16%] Building C object vendor/libunwind/CMakeFiles/unwind.dir/src/x86_64/Lregs.c.o
[ 16%] Building CXX object crashpad_build/util/CMakeFiles/crashpad_util.dir/file/file_seeker.cc.o
[ 17%] Building CXX object crashpad_build/util/CMakeFiles/crashpad_util.dir/file/file_writer.cc.o
[ 16%] Building C object vendor/libunwind/CMakeFiles/unwind.dir/src/x86_64/Lreg_states_iterate.c.o
[ 16%] Building CXX object crashpad_build/util/CMakeFiles/crashpad_util.dir/file/file_io.cc.o
[ 16%] Building CXX object crashpad_build/util/CMakeFiles/crashpad_util.dir/file/file_reader.cc.o
[ 17%] Building CXX object crashpad_build/util/CMakeFiles/crashpad_util.dir/file/output_stream_file_writer.cc.o
[ 17%] Building C object vendor/libunwind/CMakeFiles/unwind.dir/src/x86_64/Lresume.c.o
[ 17%] Building CXX object crashpad_build/util/CMakeFiles/crashpad_util.dir/file/scoped_remove_file.cc.o
[ 18%] Building C object vendor/libunwind/CMakeFiles/unwind.dir/src/x86_64/Lstash_frame.c.o
[ 18%] Building CXX object crashpad_build/util/CMakeFiles/crashpad_util.dir/file/string_file.cc.o
[ 18%] Building C object vendor/libunwind/CMakeFiles/unwind.dir/src/x86_64/Lstep.c.o
[ 19%] Building CXX object crashpad_build/util/CMakeFiles/crashpad_util.dir/misc/random_string.cc.o
[ 20%] Building CXX object crashpad_build/util/CMakeFiles/crashpad_util.dir/misc/scoped_forbid_return.cc.o
[ 20%] Building C object vendor/libunwind/CMakeFiles/unwind.dir/src/x86_64/Ltrace.c.o
[ 19%] Building CXX object crashpad_build/util/CMakeFiles/crashpad_util.dir/misc/lexing.cc.o
[ 19%] Building CXX object crashpad_build/util/CMakeFiles/crashpad_util.dir/misc/pdb_structures.cc.o
[ 19%] Building CXX object crashpad_build/util/CMakeFiles/crashpad_util.dir/misc/metrics.cc.o
[ 20%] Building CXX object crashpad_build/util/CMakeFiles/crashpad_util.dir/misc/time.cc.o
[ 19%] Building CXX object crashpad_build/util/CMakeFiles/crashpad_util.dir/misc/initialization_state_dcheck.cc.o
[ 20%] Building CXX object crashpad_build/util/CMakeFiles/crashpad_util.dir/misc/range_set.cc.o
[ 20%] Building CXX object crashpad_build/util/CMakeFiles/crashpad_util.dir/misc/reinterpret_bytes.cc.o
[ 21%] Building CXX object crashpad_build/util/CMakeFiles/crashpad_util.dir/net/http_body.cc.o
[ 20%] Building ASM object vendor/libunwind/CMakeFiles/unwind.dir/src/x86_64/setcontext.S.o
[ 21%] Building CXX object crashpad_build/util/CMakeFiles/crashpad_util.dir/misc/zlib.cc.o
[ 21%] Building CXX object crashpad_build/util/CMakeFiles/crashpad_util.dir/misc/uuid.cc.o
[ 21%] Building CXX object crashpad_build/util/CMakeFiles/crashpad_util.dir/net/http_body_gzip.cc.o
[ 21%] Building CXX object crashpad_build/util/CMakeFiles/crashpad_util.dir/net/http_multipart_builder.cc.o
[ 22%] Linking C static library libunwind.a
[ 22%] Built target unwind
[ 23%] Building CXX object crashpad_build/util/CMakeFiles/crashpad_util.dir/net/http_transport.cc.o
[ 23%] Building CXX object crashpad_build/util/CMakeFiles/crashpad_util.dir/net/url.cc.o
[ 23%] Building CXX object crashpad_build/util/CMakeFiles/crashpad_util.dir/numeric/checked_address_range.cc.o
[ 23%] Building CXX object crashpad_build/util/CMakeFiles/crashpad_util.dir/process/process_memory.cc.o
[ 23%] Building CXX object crashpad_build/util/CMakeFiles/crashpad_util.dir/process/process_memory_range.cc.o
[ 24%] Building CXX object crashpad_build/util/CMakeFiles/crashpad_util.dir/stdlib/aligned_allocator.cc.o
[ 24%] Building CXX object crashpad_build/util/CMakeFiles/crashpad_util.dir/stdlib/strlcpy.cc.o
[ 24%] Building CXX object crashpad_build/util/CMakeFiles/crashpad_util.dir/stdlib/string_number_conversion.cc.o
[ 24%] Building CXX object crashpad_build/util/CMakeFiles/crashpad_util.dir/stdlib/strnlen.cc.o
[ 24%] Building CXX object crashpad_build/util/CMakeFiles/crashpad_util.dir/stream/base94_output_stream.cc.o
[ 25%] Building CXX object crashpad_build/util/CMakeFiles/crashpad_util.dir/stream/file_encoder.cc.o
[ 25%] Building CXX object crashpad_build/util/CMakeFiles/crashpad_util.dir/stream/file_output_stream.cc.o
[ 25%] Building CXX object crashpad_build/util/CMakeFiles/crashpad_util.dir/stream/log_output_stream.cc.o
[ 25%] Building CXX object crashpad_build/util/CMakeFiles/crashpad_util.dir/stream/zlib_output_stream.cc.o
[ 25%] Building CXX object crashpad_build/util/CMakeFiles/crashpad_util.dir/string/split_string.cc.o
[ 26%] Building CXX object crashpad_build/util/CMakeFiles/crashpad_util.dir/thread/thread_log_messages.cc.o
[ 26%] Building CXX object crashpad_build/util/CMakeFiles/crashpad_util.dir/thread/thread.cc.o
[ 26%] Building CXX object crashpad_build/util/CMakeFiles/crashpad_util.dir/thread/worker_thread.cc.o
[ 26%] Building CXX object crashpad_build/util/CMakeFiles/crashpad_util.dir/file/directory_reader_posix.cc.o
[ 27%] Building CXX object crashpad_build/util/CMakeFiles/crashpad_util.dir/file/filesystem_posix.cc.o
[ 27%] Building CXX object crashpad_build/util/CMakeFiles/crashpad_util.dir/file/file_io_posix.cc.o
[ 27%] Building CXX object crashpad_build/util/CMakeFiles/crashpad_util.dir/misc/clock_posix.cc.o
[ 27%] Building CXX object crashpad_build/util/CMakeFiles/crashpad_util.dir/posix/close_stdio.cc.o
[ 27%] Building CXX object crashpad_build/util/CMakeFiles/crashpad_util.dir/posix/scoped_dir.cc.o
[ 28%] Building CXX object crashpad_build/util/CMakeFiles/crashpad_util.dir/posix/scoped_mmap.cc.o
[ 28%] Building CXX object crashpad_build/util/CMakeFiles/crashpad_util.dir/synchronization/semaphore_posix.cc.o
[ 28%] Building CXX object crashpad_build/util/CMakeFiles/crashpad_util.dir/posix/signals.cc.o
[ 28%] Building CXX object crashpad_build/util/CMakeFiles/crashpad_util.dir/thread/thread_posix.cc.o
[ 28%] Building CXX object crashpad_build/util/CMakeFiles/crashpad_util.dir/posix/close_multiple.cc.o
[ 28%] Building CXX object crashpad_build/util/CMakeFiles/crashpad_util.dir/posix/spawn_subprocess.cc.o
[ 28%] Building CXX object crashpad_build/util/CMakeFiles/crashpad_util.dir/posix/symbolic_constants_posix.cc.o
[ 29%] Building CXX object crashpad_build/util/CMakeFiles/crashpad_util.dir/posix/drop_privileges.cc.o
[ 29%] Building CXX object crashpad_build/util/CMakeFiles/crashpad_util.dir/net/http_transport_libcurl.cc.o
[ 30%] Building CXX object crashpad_build/util/CMakeFiles/crashpad_util.dir/linux/auxiliary_vector.cc.o
[ 30%] Building CXX object crashpad_build/util/CMakeFiles/crashpad_util.dir/linux/direct_ptrace_connection.cc.o
[ 31%] Building CXX object crashpad_build/util/CMakeFiles/crashpad_util.dir/linux/pac_helper.cc.o
[ 30%] Building CXX object crashpad_build/util/CMakeFiles/crashpad_util.dir/linux/exception_handler_protocol.cc.o
[ 30%] Building CXX object crashpad_build/util/CMakeFiles/crashpad_util.dir/linux/exception_handler_client.cc.o
[ 30%] Building CXX object crashpad_build/util/CMakeFiles/crashpad_util.dir/linux/memory_map.cc.o
[ 31%] Building CXX object crashpad_build/util/CMakeFiles/crashpad_util.dir/linux/proc_stat_reader.cc.o
[ 31%] Building CXX object crashpad_build/util/CMakeFiles/crashpad_util.dir/linux/proc_task_reader.cc.o
[ 31%] Building CXX object crashpad_build/util/CMakeFiles/crashpad_util.dir/linux/ptrace_client.cc.o
[ 31%] Building CXX object crashpad_build/util/CMakeFiles/crashpad_util.dir/linux/ptrace_broker.cc.o
[ 32%] Building CXX object crashpad_build/util/CMakeFiles/crashpad_util.dir/linux/ptracer.cc.o
[ 32%] Building CXX object crashpad_build/util/CMakeFiles/crashpad_util.dir/linux/scoped_pr_set_dumpable.cc.o
[ 32%] Building CXX object crashpad_build/util/CMakeFiles/crashpad_util.dir/linux/scoped_pr_set_ptracer.cc.o
[ 32%] Building CXX object crashpad_build/util/CMakeFiles/crashpad_util.dir/linux/scoped_ptrace_attach.cc.o
[ 33%] Building CXX object crashpad_build/util/CMakeFiles/crashpad_util.dir/linux/thread_info.cc.o
[ 33%] Building CXX object crashpad_build/util/CMakeFiles/crashpad_util.dir/linux/socket.cc.o
[ 33%] Building ASM object crashpad_build/util/CMakeFiles/crashpad_util.dir/misc/capture_context_linux.S.o
[ 33%] Building CXX object crashpad_build/util/CMakeFiles/crashpad_util.dir/misc/paths_linux.cc.o
[ 33%] Building CXX object crashpad_build/util/CMakeFiles/crashpad_util.dir/misc/time_linux.cc.o
[ 34%] Building CXX object crashpad_build/util/CMakeFiles/crashpad_util.dir/posix/process_info_linux.cc.o
[ 33%] Building CXX object crashpad_build/util/CMakeFiles/crashpad_util.dir/process/process_memory_linux.cc.o
[ 34%] Building CXX object crashpad_build/util/CMakeFiles/crashpad_util.dir/process/process_memory_sanitized.cc.o
[ 34%] Linking CXX static library libcrashpad_util.a
[ 34%] Built target crashpad_util
[ 34%] Building CXX object crashpad_build/client/CMakeFiles/crashpad_client.dir/annotation_list.cc.o
[ 34%] Building CXX object crashpad_build/client/CMakeFiles/crashpad_client.dir/annotation.cc.o
[ 34%] Building CXX object crashpad_build/client/CMakeFiles/crashpad_client.dir/crash_report_database.cc.o
[ 34%] Building CXX object crashpad_build/client/CMakeFiles/crashpad_client.dir/crashpad_info.cc.o
[ 35%] Building CXX object crashpad_build/client/CMakeFiles/crashpad_client.dir/settings.cc.o
[ 35%] Building CXX object crashpad_build/client/CMakeFiles/crashpad_client.dir/crashpad_client_linux.cc.o
[ 35%] Building CXX object crashpad_build/client/CMakeFiles/crashpad_client.dir/prune_crash_reports.cc.o
[ 35%] Building CXX object crashpad_build/client/CMakeFiles/crashpad_client.dir/client_argv_handling.cc.o
[ 35%] Building CXX object crashpad_build/client/CMakeFiles/crashpad_client.dir/crash_report_database_generic.cc.o
[ 36%] Building ASM object crashpad_build/client/CMakeFiles/crashpad_client.dir/crashpad_info_note.S.o
[ 36%] Linking CXX static library libcrashpad_client.a
[ 36%] Built target crashpad_client
[ 37%] Building CXX object crashpad_build/snapshot/CMakeFiles/crashpad_snapshot.dir/annotation_snapshot.cc.o
[ 37%] Building CXX object crashpad_build/snapshot/CMakeFiles/crashpad_snapshot.dir/crashpad_info_client_options.cc.o
[ 37%] Building CXX object crashpad_build/snapshot/CMakeFiles/crashpad_snapshot.dir/cpu_context.cc.o
[ 39%] Building C object tests/unit/CMakeFiles/sentry_fuzz_json.dir/__/__/src/sentry_app_hang_latch.c.o
[ 39%] Building CXX object crashpad_build/snapshot/CMakeFiles/crashpad_snapshot.dir/memory_snapshot.cc.o
[ 39%] Building CXX object crashpad_build/snapshot/CMakeFiles/crashpad_snapshot.dir/minidump/memory_snapshot_minidump.cc.o
[ 39%] Building C object tests/unit/CMakeFiles/sentry_fuzz_json.dir/__/__/src/sentry_alloc.c.o
[ 39%] Building CXX object crashpad_build/snapshot/CMakeFiles/crashpad_snapshot.dir/minidump/minidump_annotation_reader.cc.o
[ 40%] Building C object tests/unit/CMakeFiles/sentry_test_unit.dir/__/__/src/sentry_app_hang_monitor.c.o
[ 37%] Building CXX object crashpad_build/snapshot/CMakeFiles/crashpad_snapshot.dir/capture_memory.cc.o
[ 37%] Building C object tests/unit/CMakeFiles/sentry_test_unit.dir/__/__/src/sentry_attachment.c.o
[ 41%] Building CXX object crashpad_build/snapshot/CMakeFiles/crashpad_snapshot.dir/minidump/minidump_context_converter.cc.o
[ 40%] Building CXX object crashpad_build/snapshot/CMakeFiles/crashpad_snapshot.dir/handle_snapshot.cc.o
[ 41%] Building C object tests/unit/CMakeFiles/sentry_test_unit.dir/__/__/src/sentry_client_report.c.o
[ 39%] Building C object tests/unit/CMakeFiles/sentry_fuzz_json.dir/__/__/src/sentry_mpack.c.o
[ 40%] Building C object tests/unit/CMakeFiles/sentry_fuzz_json.dir/__/__/src/sentry_app_hang_monitor.c.o
[ 39%] Building C object tests/unit/CMakeFiles/sentry_test_unit.dir/__/__/src/sentry_mpack.c.o
[ 39%] Building C object tests/unit/CMakeFiles/sentry_test_unit.dir/__/__/src/sentry_alloc.c.o
[ 39%] Building CXX object crashpad_build/snapshot/CMakeFiles/crashpad_snapshot.dir/minidump/exception_snapshot_minidump.cc.o
[ 39%] Building C object tests/unit/CMakeFiles/sentry_test_unit.dir/__/__/src/sentry_app_hang_latch.c.o
[ 41%] Building C object tests/unit/CMakeFiles/sentry_test_unit.dir/__/__/src/sentry_batcher.c.o
[ 41%] Building C object tests/unit/CMakeFiles/sentry_fuzz_json.dir/__/__/src/sentry_attachment.c.o
[ 42%] Building C object tests/unit/CMakeFiles/sentry_test_unit.dir/__/__/src/sentry_core.c.o
[ 41%] Building C object tests/unit/CMakeFiles/sentry_test_unit.dir/__/__/src/sentry_backend.c.o
[ 42%] Building CXX object crashpad_build/snapshot/CMakeFiles/crashpad_snapshot.dir/minidump/minidump_simple_string_dictionary_reader.cc.o
[ 42%] Building C object tests/unit/CMakeFiles/sentry_fuzz_json.dir/__/__/src/sentry_backend.c.o
[ 42%] Building C object tests/unit/CMakeFiles/sentry_test_unit.dir/__/__/src/sentry_database.c.o
[ 42%] Building C object tests/unit/CMakeFiles/sentry_fuzz_json.dir/__/__/src/sentry_batcher.c.o
[ 42%] Building CXX object crashpad_build/snapshot/CMakeFiles/crashpad_snapshot.dir/minidump/minidump_string_reader.cc.o
[ 42%] Building CXX object crashpad_build/snapshot/CMakeFiles/crashpad_snapshot.dir/minidump/minidump_string_list_reader.cc.o
[ 43%] Building CXX object crashpad_build/snapshot/CMakeFiles/crashpad_snapshot.dir/minidump/process_snapshot_minidump.cc.o
[ 43%] Building C object tests/unit/CMakeFiles/sentry_test_unit.dir/__/__/src/sentry_envelope.c.o
[ 43%] Building CXX object crashpad_build/snapshot/CMakeFiles/crashpad_snapshot.dir/minidump/system_snapshot_minidump.cc.o
[ 43%] Building CXX object crashpad_build/snapshot/CMakeFiles/crashpad_snapshot.dir/minidump/module_snapshot_minidump.cc.o
[ 44%] Building C object tests/unit/CMakeFiles/sentry_fuzz_json.dir/__/__/src/sentry_client_report.c.o
[ 44%] Building CXX object crashpad_build/snapshot/CMakeFiles/crashpad_snapshot.dir/unloaded_module_snapshot.cc.o
[ 45%] Building CXX object crashpad_build/snapshot/CMakeFiles/crashpad_snapshot.dir/posix/timezone.cc.o
[ 45%] Building C object tests/unit/CMakeFiles/sentry_fuzz_json.dir/__/__/src/sentry_database.c.o
[ 44%] Building C object tests/unit/CMakeFiles/sentry_fuzz_json.dir/__/__/src/sentry_core.c.o
[ 44%] Building C object tests/unit/CMakeFiles/sentry_test_unit.dir/__/__/src/sentry_hint.c.o
[ 44%] Building CXX object crashpad_build/snapshot/CMakeFiles/crashpad_snapshot.dir/minidump/thread_snapshot_minidump.cc.o
[ 44%] Building CXX object crashpad_build/snapshot/CMakeFiles/crashpad_snapshot.dir/crashpad_types/crashpad_info_reader.cc.o
[ 45%] Building CXX object crashpad_build/snapshot/CMakeFiles/crashpad_snapshot.dir/linux/capture_memory_delegate_linux.cc.o
[ 45%] Building C object tests/unit/CMakeFiles/sentry_fuzz_json.dir/__/__/src/sentry_envelope.c.o
[ 45%] Building C object tests/unit/CMakeFiles/sentry_test_unit.dir/__/__/src/sentry_info.c.o
[ 46%] Building C object tests/unit/CMakeFiles/sentry_test_unit.dir/__/__/src/sentry_json.c.o
[ 46%] Building C object tests/unit/CMakeFiles/sentry_fuzz_json.dir/__/__/src/sentry_hint.c.o
[ 46%] Building CXX object crashpad_build/snapshot/CMakeFiles/crashpad_snapshot.dir/linux/cpu_context_linux.cc.o
[ 46%] Building CXX object crashpad_build/snapshot/CMakeFiles/crashpad_snapshot.dir/linux/debug_rendezvous.cc.o
[ 47%] Building CXX object crashpad_build/snapshot/CMakeFiles/crashpad_snapshot.dir/linux/exception_snapshot_linux.cc.o
[ 47%] Building C object tests/unit/CMakeFiles/sentry_test_unit.dir/__/__/src/sentry_logger.c.o
[ 48%] Building CXX object crashpad_build/snapshot/CMakeFiles/crashpad_snapshot.dir/linux/process_reader_linux.cc.o
[ 48%] Building CXX object crashpad_build/snapshot/CMakeFiles/crashpad_snapshot.dir/linux/process_snapshot_linux.cc.o
[ 48%] Building C object tests/unit/CMakeFiles/sentry_fuzz_json.dir/__/__/src/sentry_logger.c.o
[ 48%] Building C object tests/unit/CMakeFiles/sentry_test_unit.dir/__/__/src/sentry_metrics.c.o
[ 48%] Building C object tests/unit/CMakeFiles/sentry_fuzz_json.dir/__/__/src/sentry_json.c.o
[ 48%] Building CXX object crashpad_build/snapshot/CMakeFiles/crashpad_snapshot.dir/linux/thread_snapshot_linux.cc.o
[ 48%] Building C object tests/unit/CMakeFiles/sentry_test_unit.dir/__/__/src/sentry_logs.c.o
[ 48%] Building CXX object crashpad_build/snapshot/CMakeFiles/crashpad_snapshot.dir/linux/system_snapshot_linux.cc.o
[ 48%] Building C object tests/unit/CMakeFiles/sentry_fuzz_json.dir/__/__/src/sentry_info.c.o
[ 49%] Building C object tests/unit/CMakeFiles/sentry_test_unit.dir/__/__/src/sentry_options.c.o
[ 48%] Building C object tests/unit/CMakeFiles/sentry_fuzz_json.dir/__/__/src/sentry_logs.c.o
[ 50%] Building CXX object crashpad_build/snapshot/CMakeFiles/crashpad_snapshot.dir/sanitized/module_snapshot_sanitized.cc.o
[ 51%] Building CXX object crashpad_build/snapshot/CMakeFiles/crashpad_snapshot.dir/sanitized/sanitization_information.cc.o
[ 51%] Building CXX object crashpad_build/snapshot/CMakeFiles/crashpad_snapshot.dir/sanitized/memory_snapshot_sanitized.cc.o
[ 50%] Building C object tests/unit/CMakeFiles/sentry_test_unit.dir/__/__/src/sentry_os.c.o
[ 51%] Building C object tests/unit/CMakeFiles/sentry_test_unit.dir/__/__/src/sentry_retry.c.o
[ 51%] Building C object tests/unit/CMakeFiles/sentry_fuzz_json.dir/__/__/src/sentry_options.c.o
[ 51%] Building CXX object crashpad_build/snapshot/CMakeFiles/crashpad_snapshot.dir/sanitized/thread_snapshot_sanitized.cc.o
[ 51%] Building C object tests/unit/CMakeFiles/sentry_fuzz_json.dir/__/__/src/sentry_os.c.o
[ 51%] Building C object tests/unit/CMakeFiles/sentry_test_unit.dir/__/__/src/sentry_ratelimiter.c.o
[ 51%] Building CXX object crashpad_build/snapshot/CMakeFiles/crashpad_snapshot.dir/sanitized/process_snapshot_sanitized.cc.o
[ 51%] Building C object tests/unit/CMakeFiles/sentry_fuzz_json.dir/__/__/src/sentry_metrics.c.o
[ 51%] Building C object tests/unit/CMakeFiles/sentry_fuzz_json.dir/__/__/src/sentry_ratelimiter.c.o
[ 51%] Building C object tests/unit/CMakeFiles/sentry_test_unit.dir/__/__/src/sentry_ringbuffer.c.o
[ 52%] Building CXX object crashpad_build/snapshot/CMakeFiles/crashpad_snapshot.dir/crashpad_types/image_annotation_reader.cc.o
[ 53%] Building CXX object crashpad_build/snapshot/CMakeFiles/crashpad_snapshot.dir/elf/elf_dynamic_array_reader.cc.o
[ 53%] Building CXX object crashpad_build/snapshot/CMakeFiles/crashpad_snapshot.dir/elf/elf_image_reader.cc.o
[ 53%] Building C object tests/unit/CMakeFiles/sentry_test_unit.dir/__/__/src/sentry_scope.c.o
[ 53%] Building C object tests/unit/CMakeFiles/sentry_fuzz_json.dir/__/__/src/sentry_retry.c.o
[ 53%] Building C object tests/unit/CMakeFiles/sentry_test_unit.dir/__/__/src/sentry_session.c.o
[ 53%] Building CXX object crashpad_build/snapshot/CMakeFiles/crashpad_snapshot.dir/elf/elf_symbol_table_reader.cc.o
[ 53%] Building CXX object crashpad_build/snapshot/CMakeFiles/crashpad_snapshot.dir/x86/cpuid_reader.cc.o
[ 53%] Building C object tests/unit/CMakeFiles/sentry_test_unit.dir/__/__/src/sentry_slice.c.o
[ 55%] Building C object tests/unit/CMakeFiles/sentry_fuzz_json.dir/__/__/src/sentry_scope.c.o
[ 55%] Building CXX object crashpad_build/snapshot/CMakeFiles/crashpad_snapshot.dir/elf/module_snapshot_elf.cc.o
[ 55%] Building C object tests/unit/CMakeFiles/sentry_fuzz_json.dir/__/__/src/sentry_ringbuffer.c.o
[ 55%] Building C object tests/unit/CMakeFiles/sentry_test_unit.dir/__/__/src/sentry_string.c.o
[ 55%] Building C object tests/unit/CMakeFiles/sentry_fuzz_json.dir/__/__/src/sentry_session.c.o
[ 55%] Building C object tests/unit/CMakeFiles/sentry_test_unit.dir/__/__/src/sentry_sync.c.o
[ 55%] Building C object tests/unit/CMakeFiles/sentry_fuzz_json.dir/__/__/src/sentry_slice.c.o
[ 56%] Building C object tests/unit/CMakeFiles/sentry_test_unit.dir/__/__/src/sentry_telemetry.c.o
[ 56%] Building C object tests/unit/CMakeFiles/sentry_fuzz_json.dir/__/__/src/sentry_string.c.o
[ 56%] Building C object tests/unit/CMakeFiles/sentry_test_unit.dir/__/__/src/sentry_transport.c.o
[ 57%] Building C object tests/unit/CMakeFiles/sentry_fuzz_json.dir/__/__/src/sentry_sync.c.o
[ 57%] Building C object tests/unit/CMakeFiles/sentry_test_unit.dir/__/__/src/sentry_utils.c.o
[ 57%] Building C object tests/unit/CMakeFiles/sentry_test_unit.dir/__/__/src/sentry_uuid.c.o
[ 57%] Building C object tests/unit/CMakeFiles/sentry_fuzz_json.dir/__/__/src/sentry_telemetry.c.o
[ 57%] Building C object tests/unit/CMakeFiles/sentry_test_unit.dir/__/__/src/sentry_value.c.o
[ 57%] Building C object tests/unit/CMakeFiles/sentry_fuzz_json.dir/__/__/src/sentry_transport.c.o
[ 58%] Building C object tests/unit/CMakeFiles/sentry_test_unit.dir/__/__/src/sentry_writer.c.o
[ 58%] Building C object tests/unit/CMakeFiles/sentry_fuzz_json.dir/__/__/src/sentry_utils.c.o
[ 58%] Building C object tests/unit/CMakeFiles/sentry_test_unit.dir/__/__/src/path/sentry_path.c.o
[ 59%] Building C object tests/unit/CMakeFiles/sentry_test_unit.dir/__/__/src/screenshot/sentry_screenshot.c.o
[ 59%] Building C object tests/unit/CMakeFiles/sentry_fuzz_json.dir/__/__/src/sentry_tracing.c.o
[ 59%] Building C object tests/unit/CMakeFiles/sentry_fuzz_json.dir/__/__/src/sentry_value.c.o
[ 59%] Building C object tests/unit/CMakeFiles/sentry_fuzz_json.dir/__/__/src/sentry_uuid.c.o
[ 60%] Building C object tests/unit/CMakeFiles/sentry_test_unit.dir/__/__/src/transports/sentry_http_transport.c.o
[ 60%] Building C object tests/unit/CMakeFiles/sentry_test_unit.dir/__/__/src/unwinder/sentry_unwinder.c.o
[ 58%] Building C object tests/unit/CMakeFiles/sentry_test_unit.dir/__/__/src/sentry_tracing.c.o
[ 60%] Building C object tests/unit/CMakeFiles/sentry_fuzz_json.dir/__/__/src/sentry_writer.c.o
[ 60%] Building C object tests/unit/CMakeFiles/sentry_fuzz_json.dir/__/__/src/path/sentry_path.c.o
[ 60%] Building C object tests/unit/CMakeFiles/sentry_test_unit.dir/__/__/src/transports/sentry_function_transport.c.o
[ 60%] Building C object tests/unit/CMakeFiles/sentry_test_unit.dir/__/__/src/session_replay/sentry_session_replay.c.o
[ 61%] Building C object tests/unit/CMakeFiles/sentry_test_unit.dir/__/__/src/sentry_unix_pageallocator.c.o
[ 62%] Building C object tests/unit/CMakeFiles/sentry_fuzz_json.dir/__/__/src/transports/sentry_http_transport.c.o
[ 62%] Building C object tests/unit/CMakeFiles/sentry_fuzz_json.dir/__/__/src/screenshot/sentry_screenshot.c.o
[ 62%] Building C object tests/unit/CMakeFiles/sentry_test_unit.dir/__/__/src/symbolizer/sentry_symbolizer_unix.c.o
[ 60%] Building C object tests/unit/CMakeFiles/sentry_test_unit.dir/__/__/src/sentry_random.c.o
[ 64%] Building C object tests/unit/CMakeFiles/sentry_test_unit.dir/__/__/src/unwinder/sentry_unwinder_libunwind.c.o
[ 65%] Building C object tests/unit/CMakeFiles/sentry_fuzz_json.dir/__/__/src/process/sentry_process_unix.c.o
[ 65%] Building C object tests/unit/CMakeFiles/sentry_fuzz_json.dir/__/__/src/sentry_random.c.o
[ 62%] Building C object tests/unit/CMakeFiles/sentry_test_unit.dir/__/__/src/modulefinder/sentry_modulefinder_linux.c.o
[ 62%] Building C object tests/unit/CMakeFiles/sentry_test_unit.dir/__/__/src/path/sentry_path_unix.c.o
[ 62%] Building C object tests/unit/CMakeFiles/sentry_fuzz_json.dir/__/__/src/transports/sentry_function_transport.c.o
[ 62%] Building C object tests/unit/CMakeFiles/sentry_test_unit.dir/__/__/src/process/sentry_process_unix.c.o
[ 63%] Building C object tests/unit/CMakeFiles/sentry_test_unit.dir/__/__/src/transports/sentry_http_transport_curl.c.o
[ 62%] Building C object tests/unit/CMakeFiles/sentry_fuzz_json.dir/__/__/src/unwinder/sentry_unwinder.c.o
[ 62%] Building C object tests/unit/CMakeFiles/sentry_fuzz_json.dir/__/__/src/session_replay/sentry_session_replay.c.o
[ 64%] Building C object tests/unit/CMakeFiles/sentry_fuzz_json.dir/__/__/src/path/sentry_path_unix.c.o
[ 66%] Building C object tests/unit/CMakeFiles/sentry_test_unit.dir/__/__/vendor/stb_sprintf.c.o
[ 64%] Building CXX object tests/unit/CMakeFiles/sentry_test_unit.dir/__/__/src/backends/sentry_backend_crashpad.cpp.o
[ 66%] Building C object tests/unit/CMakeFiles/sentry_test_unit.dir/__/__/src/screenshot/sentry_screenshot_none.c.o
[ 65%] Building C object tests/unit/CMakeFiles/sentry_fuzz_json.dir/__/__/src/transports/sentry_http_transport_curl.c.o
[ 65%] Building C object tests/unit/CMakeFiles/sentry_fuzz_json.dir/__/__/src/modulefinder/sentry_modulefinder_linux.c.o
[ 65%] Building C object tests/unit/CMakeFiles/sentry_test_unit.dir/__/__/src/sentry_thread_stackwalk_posix.c.o
[ 64%] Building C object tests/unit/CMakeFiles/sentry_fuzz_json.dir/__/__/src/symbolizer/sentry_symbolizer_unix.c.o
[ 64%] Building C object tests/unit/CMakeFiles/sentry_fuzz_json.dir/__/__/src/sentry_unix_pageallocator.c.o
[ 67%] Building C object tests/unit/CMakeFiles/sentry_fuzz_json.dir/__/__/src/session_replay/sentry_session_replay_none.c.o
[ 66%] Building C object tests/unit/CMakeFiles/sentry_test_unit.dir/__/__/src/session_replay/sentry_session_replay_none.c.o
[ 67%] Building C object tests/unit/CMakeFiles/sentry_test_unit.dir/test_cache.c.o
[ 65%] Building CXX object tests/unit/CMakeFiles/sentry_fuzz_json.dir/__/__/src/backends/sentry_backend_crashpad.cpp.o
[ 65%] Building C object tests/unit/CMakeFiles/sentry_fuzz_json.dir/__/__/src/unwinder/sentry_unwinder_libunwind.c.o
[ 68%] Building C object tests/unit/CMakeFiles/sentry_test_unit.dir/test_app_hang.c.o
[ 67%] Building C object tests/unit/CMakeFiles/sentry_fuzz_json.dir/__/__/src/screenshot/sentry_screenshot_none.c.o
[ 69%] Building C object tests/unit/CMakeFiles/sentry_test_unit.dir/test_consent.c.o
[ 67%] Building C object tests/unit/CMakeFiles/sentry_test_unit.dir/test_batcher.c.o
[ 68%] Building C object tests/unit/CMakeFiles/sentry_fuzz_json.dir/fuzz.c.o
[ 67%] Building C object tests/unit/CMakeFiles/sentry_fuzz_json.dir/__/__/vendor/stb_sprintf.c.o
[ 67%] Building C object tests/unit/CMakeFiles/sentry_fuzz_json.dir/__/__/src/sentry_thread_stackwalk_posix.c.o
[ 68%] Building C object tests/unit/CMakeFiles/sentry_test_unit.dir/test_attachments.c.o
[ 67%] Building C object tests/unit/CMakeFiles/sentry_test_unit.dir/main.c.o
[ 68%] Building C object tests/unit/CMakeFiles/sentry_test_unit.dir/test_basic.c.o
[ 68%] Building C object tests/unit/CMakeFiles/sentry_test_unit.dir/test_client_report.c.o
[ 69%] Building C object tests/unit/CMakeFiles/sentry_test_unit.dir/test_embedded_info.c.o
[ 69%] Building C object tests/unit/CMakeFiles/sentry_test_unit.dir/test_concurrency.c.o
[ 69%] Linking CXX static library libcrashpad_snapshot.a
[ 69%] Building C object tests/unit/CMakeFiles/sentry_test_unit.dir/test_envelopes.c.o
[ 70%] Building C object tests/unit/CMakeFiles/sentry_test_unit.dir/test_failures.c.o
[ 70%] Building C object tests/unit/CMakeFiles/sentry_test_unit.dir/test_feedback.c.o
[ 70%] Building C object tests/unit/CMakeFiles/sentry_test_unit.dir/test_fuzzfailures.c.o
[ 70%] Building C object tests/unit/CMakeFiles/sentry_test_unit.dir/test_http_transport.c.o
[ 70%] Building C object tests/unit/CMakeFiles/sentry_test_unit.dir/test_info.c.o
[ 70%] Built target crashpad_snapshot
[ 70%] Building C object tests/unit/CMakeFiles/sentry_test_unit.dir/test_logs.c.o
[ 71%] Building C object tests/unit/CMakeFiles/sentry_test_unit.dir/test_metrics.c.o
[ 71%] Building C object tests/unit/CMakeFiles/sentry_test_unit.dir/test_logger.c.o
[ 71%] Building CXX object crashpad_build/minidump/CMakeFiles/crashpad_minidump.dir/minidump_annotation_writer.cc.o
[ 72%] Building CXX object crashpad_build/minidump/CMakeFiles/crashpad_minidump.dir/minidump_byte_array_writer.cc.o
[ 72%] Building CXX object crashpad_build/minidump/CMakeFiles/crashpad_minidump.dir/minidump_context_writer.cc.o
[ 72%] Building C object tests/unit/CMakeFiles/sentry_test_unit.dir/test_modulefinder.c.o
[ 72%] Building CXX object crashpad_build/minidump/CMakeFiles/crashpad_minidump.dir/minidump_exception_writer.cc.o
[ 72%] Building CXX object crashpad_build/minidump/CMakeFiles/crashpad_minidump.dir/minidump_crashpad_info_writer.cc.o
[ 73%] Building CXX object crashpad_build/minidump/CMakeFiles/crashpad_minidump.dir/minidump_extensions.cc.o
[ 73%] Building C object tests/unit/CMakeFiles/sentry_test_unit.dir/test_mpack.c.o
[ 74%] Building C object tests/unit/CMakeFiles/sentry_test_unit.dir/test_native_backend.c.o
[ 74%] Building CXX object crashpad_build/minidump/CMakeFiles/crashpad_minidump.dir/minidump_file_writer.cc.o
[ 74%] Building C object tests/unit/CMakeFiles/sentry_test_unit.dir/test_options.c.o
[ 74%] Building CXX object crashpad_build/minidump/CMakeFiles/crashpad_minidump.dir/minidump_handle_writer.cc.o
[ 74%] Building CXX object crashpad_build/minidump/CMakeFiles/crashpad_minidump.dir/minidump_memory_info_writer.cc.o
[ 74%] Building C object tests/unit/CMakeFiles/sentry_test_unit.dir/test_os.c.o
[ 74%] Building CXX object crashpad_build/minidump/CMakeFiles/crashpad_minidump.dir/minidump_memory_writer.cc.o
[ 75%] Building C object tests/unit/CMakeFiles/sentry_test_unit.dir/test_path.c.o
[ 75%] Building CXX object crashpad_build/minidump/CMakeFiles/crashpad_minidump.dir/minidump_module_writer.cc.o
[ 75%] Building CXX object crashpad_build/minidump/CMakeFiles/crashpad_minidump.dir/minidump_misc_info_writer.cc.o
[ 75%] Building CXX object crashpad_build/minidump/CMakeFiles/crashpad_minidump.dir/minidump_module_crashpad_info_writer.cc.o
[ 76%] Building C object tests/unit/CMakeFiles/sentry_test_unit.dir/test_process.c.o
[ 76%] Building C object tests/unit/CMakeFiles/sentry_test_unit.dir/test_ratelimiter.c.o
[ 76%] Building CXX object crashpad_build/minidump/CMakeFiles/crashpad_minidump.dir/minidump_rva_list_writer.cc.o
[ 76%] Building C object tests/unit/CMakeFiles/sentry_test_unit.dir/test_retry.c.o
[ 77%] Building CXX object crashpad_build/minidump/CMakeFiles/crashpad_minidump.dir/minidump_stream_writer.cc.o
[ 76%] Building CXX object crashpad_build/minidump/CMakeFiles/crashpad_minidump.dir/minidump_simple_string_dictionary_writer.cc.o
[ 77%] Building CXX object crashpad_build/minidump/CMakeFiles/crashpad_minidump.dir/minidump_system_info_writer.cc.o
[ 77%] Building C object tests/unit/CMakeFiles/sentry_test_unit.dir/test_ringbuffer.c.o
[ 77%] Building CXX object crashpad_build/minidump/CMakeFiles/crashpad_minidump.dir/minidump_string_writer.cc.o
[ 77%] Building C object tests/unit/CMakeFiles/sentry_test_unit.dir/test_sampling.c.o
[ 78%] Building C object tests/unit/CMakeFiles/sentry_test_unit.dir/test_scope.c.o
[ 78%] Building CXX object crashpad_build/minidump/CMakeFiles/crashpad_minidump.dir/minidump_thread_id_map.cc.o
[ 78%] Building C object tests/unit/CMakeFiles/sentry_test_unit.dir/test_session.c.o
[ 78%] Building C object tests/unit/CMakeFiles/sentry_test_unit.dir/test_slice.c.o
[ 78%] Building C object tests/unit/CMakeFiles/sentry_test_unit.dir/test_string.c.o
[ 78%] Building C object tests/unit/CMakeFiles/sentry_test_unit.dir/test_symbolizer.c.o
[ 80%] Building CXX object crashpad_build/minidump/CMakeFiles/crashpad_minidump.dir/minidump_thread_name_list_writer.cc.o
[ 80%] Building C object tests/unit/CMakeFiles/sentry_test_unit.dir/test_sync.c.o
[ 80%] Building C object tests/unit/CMakeFiles/sentry_test_unit.dir/test_tracing.c.o
[ 80%] Building CXX object crashpad_build/minidump/CMakeFiles/crashpad_minidump.dir/minidump_thread_writer.cc.o
[ 80%] Building C object tests/unit/CMakeFiles/sentry_test_unit.dir/test_tus.c.o
[ 80%] Building C object tests/unit/CMakeFiles/sentry_test_unit.dir/test_uninit.c.o
[ 80%] Building CXX object crashpad_build/minidump/CMakeFiles/crashpad_minidump.dir/minidump_unloaded_module_writer.cc.o
[ 80%] Building CXX object crashpad_build/minidump/CMakeFiles/crashpad_minidump.dir/minidump_user_extension_stream_data_source.cc.o
[ 80%] Building C object tests/unit/CMakeFiles/sentry_test_unit.dir/test_unwinder.c.o
[ 81%] Linking CXX executable sentry_fuzz_json
[ 81%] Building CXX object crashpad_build/minidump/CMakeFiles/crashpad_minidump.dir/minidump_user_stream_writer.cc.o
[ 82%] Building C object tests/unit/CMakeFiles/sentry_test_unit.dir/test_utils.c.o
[ 82%] Building C object tests/unit/CMakeFiles/sentry_test_unit.dir/test_uuid.c.o
[ 82%] Building C object tests/unit/CMakeFiles/sentry_test_unit.dir/test_value.c.o
[ 83%] Building CXX object crashpad_build/minidump/CMakeFiles/crashpad_minidump.dir/minidump_writable.cc.o
[ 83%] Building C object tests/unit/CMakeFiles/sentry_test_unit.dir/test_writer.c.o
[ 83%] Building CXX object crashpad_build/minidump/CMakeFiles/crashpad_minidump.dir/minidump_writer_util.cc.o
[ 84%] Linking CXX executable sentry_test_unit
[ 84%] Linking CXX static library libcrashpad_minidump.a
[ 84%] Built target crashpad_minidump
[ 84%] Building CXX object crashpad_build/handler/CMakeFiles/crashpad_handler_lib.dir/crash_report_upload_thread.cc.o
[ 84%] Built target sentry_fuzz_json
[ 84%] Building CXX object crashpad_build/handler/CMakeFiles/crashpad_handler_lib.dir/crash_report_upload_rate_limit.cc.o
[ 85%] Building CXX object crashpad_build/handler/CMakeFiles/crashpad_handler_lib.dir/handler_main.cc.o
[ 85%] Building CXX object crashpad_build/handler/CMakeFiles/crashpad_handler_lib.dir/minidump_to_upload_parameters.cc.o
[ 85%] Building CXX object crashpad_build/handler/CMakeFiles/crashpad_handler_lib.dir/prune_crash_reports_thread.cc.o
[ 85%] Building CXX object crashpad_build/handler/CMakeFiles/crashpad_handler_lib.dir/user_stream_data_source.cc.o
[ 85%] Building CXX object crashpad_build/handler/CMakeFiles/crashpad_handler_lib.dir/linux/capture_snapshot.cc.o
[ 86%] Building CXX object crashpad_build/handler/CMakeFiles/crashpad_handler_lib.dir/linux/crash_report_exception_handler.cc.o
[ 86%] Building CXX object crashpad_build/handler/CMakeFiles/crashpad_handler_lib.dir/linux/exception_handler_server.cc.o
[ 86%] Building CXX object crashpad_build/handler/CMakeFiles/crashpad_handler_lib.dir/linux/cros_crash_report_exception_handler.cc.o
[ 86%] Linking CXX static library libcrashpad_handler_lib.a
[ 86%] Built target crashpad_handler_lib
[ 86%] Building CXX object crashpad_build/handler/CMakeFiles/crashpad_handler.dir/main.cc.o
[ 87%] Building CXX object crashpad_build/handler/CMakeFiles/crashpad_handler.dir/__/client/pthread_create_linux.cc.o
[ 87%] Built target sentry_test_unit
[ 87%] Linking CXX executable crashpad_handler
[ 87%] Built target crashpad_handler
[ 87%] Building C object CMakeFiles/sentry.dir/src/sentry_app_hang_latch.c.o
[ 88%] Building C object CMakeFiles/sentry.dir/src/sentry_alloc.c.o
[ 88%] Building C object CMakeFiles/sentry.dir/src/sentry_mpack.c.o
[ 88%] Building C object CMakeFiles/sentry.dir/src/sentry_app_hang_monitor.c.o
[ 88%] Building C object CMakeFiles/sentry.dir/src/sentry_attachment.c.o
[ 88%] Building C object CMakeFiles/sentry.dir/src/sentry_backend.c.o
[ 89%] Building C object CMakeFiles/sentry.dir/src/sentry_batcher.c.o
[ 89%] Building C object CMakeFiles/sentry.dir/src/sentry_client_report.c.o
[ 89%] Building C object CMakeFiles/sentry.dir/src/sentry_core.c.o
[ 89%] Building C object CMakeFiles/sentry.dir/src/sentry_envelope.c.o
[ 89%] Building C object CMakeFiles/sentry.dir/src/sentry_database.c.o
[ 89%] Building C object CMakeFiles/sentry.dir/src/sentry_info.c.o
[ 89%] Building C object CMakeFiles/sentry.dir/src/sentry_logger.c.o
[ 90%] Building C object CMakeFiles/sentry.dir/src/sentry_hint.c.o
[ 90%] Building C object CMakeFiles/sentry.dir/src/sentry_json.c.o
[ 91%] Building C object CMakeFiles/sentry.dir/src/sentry_logs.c.o
[ 91%] Building C object CMakeFiles/sentry.dir/src/sentry_metrics.c.o
[ 91%] Building C object CMakeFiles/sentry.dir/src/sentry_options.c.o
[ 91%] Building C object CMakeFiles/sentry.dir/src/sentry_os.c.o
[ 92%] Building C object CMakeFiles/sentry.dir/src/sentry_retry.c.o
[ 92%] Building C object CMakeFiles/sentry.dir/src/sentry_ringbuffer.c.o
[ 92%] Building C object CMakeFiles/sentry.dir/src/sentry_scope.c.o
[ 92%] Building C object CMakeFiles/sentry.dir/src/sentry_session.c.o
[ 92%] Building C object CMakeFiles/sentry.dir/src/sentry_ratelimiter.c.o
[ 92%] Building C object CMakeFiles/sentry.dir/src/sentry_slice.c.o
[ 93%] Building C object CMakeFiles/sentry.dir/src/sentry_string.c.o
[ 93%] Building C object CMakeFiles/sentry.dir/src/sentry_sync.c.o
[ 93%] Building C object CMakeFiles/sentry.dir/src/sentry_transport.c.o
[ 93%] Building C object CMakeFiles/sentry.dir/src/sentry_telemetry.c.o
[ 94%] Building C object CMakeFiles/sentry.dir/src/sentry_utils.c.o
[ 94%] Building C object CMakeFiles/sentry.dir/src/sentry_uuid.c.o
[ 94%] Building C object CMakeFiles/sentry.dir/src/sentry_value.c.o
[ 94%] Building C object CMakeFiles/sentry.dir/src/sentry_writer.c.o
[ 94%] Building C object CMakeFiles/sentry.dir/src/sentry_tracing.c.o
[ 94%] Building C object CMakeFiles/sentry.dir/src/screenshot/sentry_screenshot.c.o
[ 95%] Building C object CMakeFiles/sentry.dir/src/path/sentry_path.c.o
[ 95%] Building C object CMakeFiles/sentry.dir/src/transports/sentry_http_transport.c.o
[ 95%] Building C object CMakeFiles/sentry.dir/src/transports/sentry_function_transport.c.o
[ 96%] Building C object CMakeFiles/sentry.dir/src/unwinder/sentry_unwinder.c.o
[ 95%] Building C object CMakeFiles/sentry.dir/src/session_replay/sentry_session_replay.c.o
[ 96%] Building C object CMakeFiles/sentry.dir/src/sentry_random.c.o
[ 96%] Building C object CMakeFiles/sentry.dir/src/symbolizer/sentry_symbolizer_unix.c.o
[ 97%] Building C object CMakeFiles/sentry.dir/src/path/sentry_path_unix.c.o
[ 97%] Building C object CMakeFiles/sentry.dir/src/process/sentry_process_unix.c.o
[ 97%] Building C object CMakeFiles/sentry.dir/src/sentry_unix_pageallocator.c.o
[ 97%] Building C object CMakeFiles/sentry.dir/src/modulefinder/sentry_modulefinder_linux.c.o
[ 97%] Building C object CMakeFiles/sentry.dir/src/transports/sentry_http_transport_curl.c.o
[ 97%] Building CXX object CMakeFiles/sentry.dir/src/backends/sentry_backend_crashpad.cpp.o
[ 98%] Building C object CMakeFiles/sentry.dir/src/unwinder/sentry_unwinder_libunwind.c.o
[ 98%] Building C object CMakeFiles/sentry.dir/src/screenshot/sentry_screenshot_none.c.o
[ 98%] Building C object CMakeFiles/sentry.dir/src/session_replay/sentry_session_replay_none.c.o
[ 98%] Building C object CMakeFiles/sentry.dir/src/sentry_thread_stackwalk_posix.c.o
[ 98%] Building C object CMakeFiles/sentry.dir/vendor/stb_sprintf.c.o
[ 99%] Linking CXX shared library libsentry.so
[ 99%] Built target sentry
[ 99%] Building C object CMakeFiles/sentry_example.dir/examples/example.c.o
[ 99%] Building CXX object tests/fixtures/early_init/CMakeFiles/sentry_early_init.dir/early_init.cpp.o
[ 99%] Building C object tests/fixtures/crash_reporter/CMakeFiles/sentry_crash_reporter.dir/crash_reporter.c.o
In file included from /usr/include/inttypes.h:25,
                 from /startdir/src/sentry-native/include/sentry.h:166,
                 from /startdir/src/sentry-native/examples/example.c:9:
/usr/include/features.h:451:4: warning: #warning _FORTIFY_SOURCE requires compiling with optimization (-O) [-Wcpp]
  451 | #  warning _FORTIFY_SOURCE requires compiling with optimization (-O)
      |    ^~~~~~~
[ 99%] Linking C executable sentry_crash_reporter
[100%] Linking CXX executable sentry_early_init
[100%] Linking C executable sentry_example
[100%] Built target sentry_crash_reporter
[100%] Built target sentry_early_init
[100%] Built target sentry_example
==> Starting check()...
============================= test session starts ==============================
platform linux -- Python 3.14.7, pytest-9.1.1, pluggy-1.6.0
rootdir: /startdir/src/sentry-native
plugins: flaky-3.8.1, pytest_httpserver-1.1.5
collected 2133 items / 12 deselected / 2121 selected

tests/test_build_static.py ..s...                                        [  0%]
tests/test_dotnet_signals.py ..ss                                        [  0%]
tests/test_e2e_sentry.py sssssss                                         [  0%]
tests/test_embedded_info.py ......                                       [  1%]
tests/test_integration_cache.py ..........................               [  2%]
tests/test_integration_client_reports.py .............                   [  2%]
tests/test_integration_crashpad.py ...sssss..sssssss.......sss..s....s.. [  4%]
..s........                                                              [  5%]
tests/test_integration_http.py ......................................... [  7%]
............                                                             [  7%]
tests/test_integration_logger.py ........                                [  8%]
tests/test_integration_logs.py .............                             [  8%]
tests/test_integration_macos_sandbox.py ssss                             [  8%]
tests/test_integration_metrics.py ...............                        [  9%]
tests/test_integration_native.py ....sssss.ss...............s........... [ 11%]
.ssss....                                                                [ 11%]
tests/test_integration_platform.py .                                     [ 11%]
tests/test_integration_proxy.py ssss                                     [ 12%]
tests/test_integration_ratelimits.py ...                                 [ 12%]
tests/test_integration_screenshot.py ssssssss                            [ 12%]
tests/test_integration_stdout.py ...........s.....sss                    [ 13%]
tests/test_integration_transactions.py ..............                    [ 14%]
tests/test_integration_tus.py .......                                    [ 14%]
tests/test_integration_wer.py sssssssssssssss                            [ 15%]
tests/test_proxy_server.py ....                                          [ 15%]
tests/test_stress_inproc.py ....sss.....                                 [ 15%]
tests/test_unit.py ..................................................... [ 18%]
s...............................s....................................... [ 21%]
........................................................................ [ 25%]
........................................................................ [ 28%]
........................................................................ [ 32%]
........................................................................ [ 35%]
........................................................................ [ 38%]
........................................................................ [ 42%]
........................................................................ [ 45%]
.......................................................F................ [ 49%]
..............................s......................................... [ 52%]
.........................................................ss............. [ 55%]
........................................................................ [ 59%]
........................................................................ [ 62%]
........................................................................ [ 66%]
........................................................................ [ 69%]
........................................................................ [ 72%]
....................................s...............................s... [ 76%]
........................................................................ [ 79%]
........................................................................ [ 82%]
........................................................................ [ 86%]
........................................................................ [ 89%]
........................................................................ [ 93%]
........................................................................ [ 96%]
........................................................................ [ 99%]
.                                                                        [100%]

=================================== FAILURES ===================================
_________________ test_unit_transport[cache_max_size_and_age] __________________

cmake = <bound method CMake.compile of <tests.cmake.CMake object at 0x7fb5c82b8440>>
unittest = 'cache_max_size_and_age'

    @pytest.mark.skipif(not has_http, reason="tests need http transport")
    def test_unit_transport(cmake, unittest):
        if unittest in [
            "custom_logger",
            "logger_enable_disable_functionality",
            "logger_level",
        ]:
            pytest.skip("excluded from transport test-suite")
        _skip_if_unsupported(unittest)
    
        cwd = cmake(
            ["sentry_test_unit"],
            {"SENTRY_BACKEND": "none"},
        )
        env = dict(os.environ)
>       run(cwd, "sentry_test_unit", ["--no-summary", unittest], env=env)
E       Failed: running command failed: ./sentry_test_unit --no-summary cache_max_size_and_age

tests/test_unit.py:45: Failed
----------------------------- Captured stdout call -----------------------------
Test cache_max_size_and_age...                  [ FAILED ]
  test_cache.c:954: Check !sentry__path_is_file(c_path)... failed
=============================== warnings summary ===============================
tests/conftest.py:41
  /startdir/src/sentry-native/tests/conftest.py:41: PytestRemovedIn10Warning: Passing a non-Collection iterable to parametrize is deprecated.
  Test: tests/test_unit.py::test_unit, argvalues type: generator
  Please convert to a list or tuple.
  See https://docs.pytest.org/en/stable/deprecations.html#parametrize-iterators
    metafunc.parametrize("unittest", enumerate_unittests())

tests/conftest.py:41
  /startdir/src/sentry-native/tests/conftest.py:41: PytestRemovedIn10Warning: Passing a non-Collection iterable to parametrize is deprecated.
  Test: tests/test_unit.py::test_unit_transport, argvalues type: generator
  Please convert to a list or tuple.
  See https://docs.pytest.org/en/stable/deprecations.html#parametrize-iterators
    metafunc.parametrize("unittest", enumerate_unittests())

tests/conftest.py:41
  /startdir/src/sentry-native/tests/conftest.py:41: PytestRemovedIn10Warning: Passing a non-Collection iterable to parametrize is deprecated.
  Test: tests/test_unit.py::test_unit_with_test_path, argvalues type: generator
  Please convert to a list or tuple.
  See https://docs.pytest.org/en/stable/deprecations.html#parametrize-iterators
    metafunc.parametrize("unittest", enumerate_unittests())

-- Docs: https://docs.pytest.org/en/stable/how-to/capture-warnings.html
===Flaky Test Report===

test_crashpad_dumping_crash[run_args0-build_args0] passed 1 out of the required 1 times. Success!
test_crashpad_dumping_crash[run_args1-build_args1] passed 1 out of the required 1 times. Success!
test_crashpad_dumping_crash[run_args2-build_args2] passed 1 out of the required 1 times. Success!
test_crashpad_dumping_crash[run_args3-build_args3] passed 1 out of the required 1 times. Success!
test_crashpad_dumping_crash[run_args4-build_args4] passed 1 out of the required 1 times. Success!
test_crashpad_dumping_crash[run_args5-build_args5] passed 1 out of the required 1 times. Success!
test_crashpad_dumping_stack_overflow[None] passed 1 out of the required 1 times. Success!
test_breakpad_dump_inflight passed 1 out of the required 1 times. Success!
test_shutdown_timeout passed 1 out of the required 1 times. Success!

===End Flaky Test Report===
=========================== short test summary info ============================
FAILED tests/test_unit.py::test_unit_transport[cache_max_size_and_age] - Fail...
= 1 failed, 2035 passed, 85 skipped, 12 deselected, 3 warnings in 752.38s (0:12:32) =
==> ERROR: A failure occurred in check().
    Aborting...
==> ERROR: Build failed, check /home/alhp/workspace/chroot/build_b3a82094-be09-4d9f-b21a-b92bdda457eb/build
