==> Synchronizing chroot copy [/home/alhp/workspace/chroot/root] -> [build_5c9c24d3-34e1-4527-9d21-d61dbd796c26]...done
==> Making package: znc 1.10.3-1.1 (Sat Sep 19 13:07:00 2026)
==> Retrieving sources...
  -> Downloading znc-1.10.3.tar.gz...
  % Total    % Received % Xferd  Average Speed  Time    Time    Time   Current
                                 Dload  Upload  Total   Spent   Left   Speed
  0      0   0      0   0      0      0      0           00:01              0100  2.20M 100  2.20M   0      0 879.5k      0   00:02   00:02              0100  2.20M 100  2.20M   0      0 879.5k      0   00:02   00:02              0100  2.20M 100  2.20M   0      0 879.5k      0   00:02   00:02              0
  -> Downloading znc-1.10.3.tar.gz.sig...
  % Total    % Received % Xferd  Average Speed  Time    Time    Time   Current
                                 Dload  Upload  Total   Spent   Left   Speed
  0      0   0      0   0      0      0      0                              0100    594 100    594   0      0   3522      0                              0100    594 100    594   0      0   3521      0                              0100    594 100    594   0      0   3520      0                              0
  -> Found znc.tmpfiles
  -> Found znc.sysusers
==> Validating source files with sha256sums...
    znc-1.10.3.tar.gz ... Passed
    znc-1.10.3.tar.gz.sig ... Skipped
    znc.tmpfiles ... Passed
    znc.sysusers ... Passed
==> Verifying source file signatures with gpg...
    znc-1.10.3.tar.gz ... Passed
Note: in a future version of systemd-nspawn the default set of permitted socket address families will be restricted to AF_INET, AF_INET6 and AF_UNIX. Use --restrict-address-families= to configure the set of permitted socket address families, or set RestrictAddressFamilies= in a .nspawn file.
==> Making package: znc 1.10.3-1.1 (Sat Sep 19 11:07:05 2026)
==> Checking runtime dependencies...
==> Installing missing dependencies...
resolving dependencies...
looking for conflicting packages...

Package (1)   New Version  Net Change  Download Size

extra/argon2  20190702-7     0.11 MiB       0.03 MiB

Total Download Size:   0.03 MiB
Total Installed Size:  0.11 MiB

:: Proceed with installation? [Y/n] 
:: Retrieving packages...
 argon2-20190702-7-x86_64 downloading...
checking keyring...
checking package integrity...
loading package files...
checking for file conflicts...
:: Processing package changes...
installing argon2...
:: Running post-transaction hooks...
(1/1) Arming ConditionNeedsUpdate...
==> Checking buildtime dependencies...
==> Installing missing dependencies...
resolving dependencies...
looking for conflicting packages...

Package (8)               New Version  Net Change

extra/cppdap              1.58.0-3       1.61 MiB
extra/hicolor-icon-theme  0.18-1         0.05 MiB
extra/jsoncpp             1.9.8-1        0.86 MiB
extra/libuv               1.52.1-2       0.64 MiB
extra/rhash               1.4.6-1        0.34 MiB
extra/boost               1.92.0-1     151.16 MiB
extra/cmake               4.4.3-2      101.44 MiB
extra/tcl                 8.6.16-1      13.60 MiB

Total Installed Size:  269.70 MiB

:: Proceed with installation? [Y/n] 
checking keyring...
checking package integrity...
loading package files...
checking for file conflicts...
:: Processing package changes...
installing tcl...
installing cppdap...
installing hicolor-icon-theme...
installing jsoncpp...
Optional dependencies for jsoncpp
    jsoncpp-doc: documentation
installing libuv...
installing rhash...
installing cmake...
Optional dependencies for cmake
    make: for unix Makefile generator [installed]
    ninja: for ninja generator
    qt6-base: cmake-gui
installing boost...
Optional dependencies for boost
    python: for python bindings [installed]
:: Running post-transaction hooks...
(1/1) Arming ConditionNeedsUpdate...
==> Retrieving sources...
  -> Found znc-1.10.3.tar.gz
  -> Found znc-1.10.3.tar.gz.sig
  -> Found znc.tmpfiles
  -> Found znc.sysusers
==> WARNING: Skipping all source file integrity checks.
==> Extracting sources...
  -> Extracting znc-1.10.3.tar.gz with bsdtar
==> Starting prepare()...
==> Starting build()...
-- The CXX compiler identification is GNU 16.2.1
-- Detecting CXX compiler ABI info
-- Detecting CXX compiler ABI info - done
-- Check for working CXX compiler: /usr/bin/c++ - skipped
-- Detecting CXX compile features
-- Detecting CXX compile features - done
-- Checking for C++17 support
-- Checking for C++17 support - supported
-- Performing Test CMAKE_HAVE_LIBC_PTHREAD
-- Performing Test CMAKE_HAVE_LIBC_PTHREAD - Success
-- Found Threads: TRUE
-- Checking for 64-bit off_t
-- Checking for 64-bit off_t - present
-- Checking for fseeko/ftello
-- Checking for fseeko/ftello - present
-- Found PkgConfig: /usr/bin/pkg-config (found version "3.0.7")
-- Found OpenSSL: /usr/lib/libcrypto.so (found version "3.6.4")
-- Looking for SSL_SESSION_get0_cipher
-- Looking for SSL_SESSION_get0_cipher - found
-- Found ZLIB: /usr/lib/libz.so (found version "1.3.2")
-- Checking for module 'libsasl2'
--   Found libsasl2, version 2.1.28
-- Checking for module 'libargon2'
--   Found libargon2, version 20190702
-- Checking for module 'icu-uc'
--   Found icu-uc, version 78.3
-- Found PerlLibs: /usr/lib/perl5/5.42/core_perl/CORE (found suitable version "5.42.2", minimum required is "5.10")
-- Found Perl: /usr/bin/perl (found suitable version "5.42.2", minimum required is "5.10")
-- Found Python3: /usr/include/python3.14 (found version "3.14.7") found components: Development Development.Module Development.Embed
-- Found Tclsh: /bin/tclsh (found version "8.6")
-- Found Gettext: /usr/bin/msgmerge (found version "1.0")
-- Will build cctz
-- Looking for getopt_long
-- Looking for getopt_long - found
-- Looking for lstat
-- Looking for lstat - found
-- Looking for getpassphrase
-- Looking for getpassphrase - not found
-- Looking for tcsetattr
-- Looking for tcsetattr - found
-- Looking for clock_gettime
-- Looking for clock_gettime - found
-- Looking for gethostname
-- Looking for gethostname - found
-- Looking for uname
-- Looking for uname - found
-- Looking for AI_ADDRCONFIG
-- Looking for AI_ADDRCONFIG - found
-- Performing Test COMPILER_HAS_HIDDEN_VISIBILITY
-- Performing Test COMPILER_HAS_HIDDEN_VISIBILITY - Success
-- Performing Test COMPILER_HAS_HIDDEN_INLINE_VISIBILITY
-- Performing Test COMPILER_HAS_HIDDEN_INLINE_VISIBILITY - Success
-- Performing Test COMPILER_HAS_DEPRECATED_ATTR
-- Performing Test COMPILER_HAS_DEPRECATED_ATTR - Success
-- GoogleTest not found, testing will be disabled. You can set environment variables GTEST_ROOT and GMOCK_ROOT
+-----------------------+
| ZNC 1.10.3 configured |
|                       |
| Prefix    : /usr      |
| SSL       : yes       |
| IPv6      : yes       |
| Async DNS : yes       |
| Perl      : yes       |
| Python    : yes       |
| Tcl       : yes       |
| Cyrus     : yes       |
| Charset   : yes       |
| Zlib      : yes       |
| i18n      : yes       |
| Argon2    : yes       |
+-----------------------+

Now you can run 'make' to compile ZNC

-- Configuring done (3.4s)
-- Generating done (0.7s)
-- Build files have been written to: /startdir/src/build
[  0%] Generating webadmin.bg_BG.gmo
[  0%] Generating webadmin.da_DK.gmo
[  0%] Generating webadmin.tr_TR.gmo
[  0%] Generating webadmin.de_DE.gmo
[  0%] Generating webadmin.el_GR.gmo
[  0%] Generating webadmin.fr_FR.gmo
[  0%] Generating webadmin.es_ES.gmo
[  0%] Generating webadmin.id_ID.gmo
[  0%] Generating webadmin.nl_NL.gmo
[  0%] Generating webadmin.pl_PL.gmo
[  0%] Generating webadmin.pt_PT.gmo
[  0%] Generating Csocket.cpp
[  0%] Generating webadmin.ru_RU.gmo
[  0%] Generating znc.es_ES.gmo
[  0%] Generating znc.bg_BG.gmo
[  0%] Generating Csocket.h
[  0%] Generating webadmin.it_IT.gmo
[  0%] Generating znc.da_DK.gmo
[  0%] Generating webadmin.ro_RO.gmo
[  0%] Generating znc.de_DE.gmo
[  0%] Generating znc.tr_TR.gmo
[  1%] Generating webadmin.pt_BR.gmo
[  1%] Generating znc.el_GR.gmo
[  1%] Built target po_webadmin_bg_BG
[  1%] Built target po_webadmin_el_GR
[  1%] Built target version
[  1%] Built target po_webadmin_fr_FR
[  1%] Built target po_webadmin_de_DE
[  1%] Built target po_webadmin_es_ES
[  1%] Built target po_webadmin_pt_PT
[  1%] Built target po_webadmin_da_DK
[  1%] Built target po_webadmin_it_IT
[  1%] Built target po_webadmin_pl_PL
[  1%] Built target po_znc_da_DK
[  1%] Built target copy_csocket_h
[  1%] Built target po_znc_es_ES
[  1%] Built target copy_csocket_cc
[  1%] Built target po_webadmin_tr_TR
[  1%] Built target po_znc_de_DE
[  1%] Built target po_webadmin_nl_NL
[  1%] Built target po_webadmin_id_ID
[  1%] Built target po_webadmin_pt_BR
[  1%] Built target po_znc_bg_BG
[  2%] Built target po_webadmin_ro_RO
[  2%] Generating znc.fr_FR.gmo
[  2%] Generating znc.ro_RO.gmo
[  2%] Generating znc.pt_BR.gmo
[  2%] Generating znc.ru_RU.gmo
[  2%] Generating znc.it_IT.gmo
[  2%] Generating znc.pl_PL.gmo
[  2%] Generating swigperlrun.h, ZNC.pm, modperl_biglib.cpp, perlfunctions.cpp
[  1%] Built target po_znc_el_GR
[  1%] Built target po_znc_tr_TR
[  2%] Generating swigperlrun.h, ZNC.pm, modperl_biglib.cpp, perlfunctions.cpp
[  2%] Generating swigperlrun.h, ZNC.pm, modperl_biglib.cpp, perlfunctions.cpp
[  2%] Generating znc.pt_PT.gmo
[  4%] Generating admindebug.tr_TR.gmo
[  3%] Generating swigpyrun.h, znc_core.py, modpython_biglib.cpp, pyfunctions.cpp
[  2%] Generating swigpyrun.h, znc_core.py, modpython_biglib.cpp, pyfunctions.cpp
[  4%] Generating swigpyrun.h, znc_core.py, modpython_biglib.cpp, pyfunctions.cpp
[  4%] Generating admindebug.da_DK.gmo
[  2%] Generating znc.id_ID.gmo
[  2%] Generating znc.nl_NL.gmo
[  1%] Built target po_webadmin_ru_RU
[  4%] Generating admindebug.de_DE.gmo
[  5%] Generating admindebug.es_ES.gmo
[  4%] Generating admindebug.bg_BG.gmo
[  5%] Built target po_znc_ro_RO
[  5%] Generating admindebug.el_GR.gmo
[  5%] Built target po_znc_pt_BR
[  5%] Generating admindebug.fr_FR.gmo
[  5%] Built target po_admindebug_tr_TR
[  5%] Generating admindebug.id_ID.gmo
[  5%] Built target po_znc_ru_RU
[  5%] Built target po_admindebug_da_DK
[  5%] Built target po_admindebug_es_ES
[  5%] Generating admindebug.it_IT.gmo
[  5%] Built target po_admindebug_bg_BG
[  5%] Built target po_admindebug_de_DE
[  5%] Generating admindebug.nl_NL.gmo
[  5%] Built target po_znc_it_IT
[  5%] Generating admindebug.pl_PL.gmo
[  5%] Built target po_admindebug_fr_FR
[  5%] Built target po_znc_fr_FR
[  5%] Built target po_admindebug_el_GR
[  5%] Generating admindebug.pt_PT.gmo
[  5%] Generating admindebug.pt_BR.gmo
[  5%] Built target po_admindebug_id_ID
[  5%] Generating admindebug.ro_RO.gmo
[  5%] Generating admindebug.ru_RU.gmo
[  5%] Built target po_admindebug_it_IT
[  5%] Built target po_admindebug_pl_PL
[  5%] Generating adminlog.tr_TR.gmo
[  5%] Built target po_znc_pl_PL
[  5%] Generating adminlog.de_DE.gmo
[  5%] Generating adminlog.el_GR.gmo
[  5%] Built target po_admindebug_nl_NL
[  5%] Generating adminlog.fr_FR.gmo
[  5%] Built target po_admindebug_pt_BR
[  5%] Built target modperl_functions
[  5%] Built target po_admindebug_pt_PT
[  5%] Built target po_znc_nl_NL
[  5%] Built target po_znc_id_ID
[  5%] Generating adminlog.nl_NL.gmo
[  5%] Generating adminlog.id_ID.gmo
[  5%] Built target po_adminlog_tr_TR
[  5%] Generating adminlog.da_DK.gmo
[  5%] Built target po_znc_pt_PT
[  5%] Generating adminlog.bg_BG.gmo
[  5%] Generating adminlog.es_ES.gmo
[  5%] Built target po_admindebug_ro_RO
[  5%] Generating adminlog.it_IT.gmo
[  5%] Built target modperl_swigruntime
[  5%] Built target po_adminlog_de_DE
[  6%] Generating adminlog.pt_BR.gmo
[  5%] Generating adminlog.pl_PL.gmo
[  6%] Built target po_adminlog_fr_FR
[  6%] Generating adminlog.pt_PT.gmo
[  6%] Generating adminlog.ru_RU.gmo
[  6%] Built target po_admindebug_ru_RU
[  6%] Generating adminlog.ro_RO.gmo
[  6%] Built target po_adminlog_id_ID
[  6%] Generating alias.de_DE.gmo
[  6%] Built target po_adminlog_pt_BR
[  6%] Built target modperl_swig
[  6%] Built target po_adminlog_nl_NL
[  6%] Generating alias.da_DK.gmo
[  6%] Generating alias.bg_BG.gmo
[  6%] Generating alias.el_GR.gmo
[  6%] Generating alias.es_ES.gmo
[  6%] Generating alias.tr_TR.gmo
[  6%] Built target po_adminlog_da_DK
CMake Error: Problem with archive_write_header(): Can't create 'swig_version.h'
CMake Error: Current file:
  swig_version.h
CMake Error: Problem extracting tar:
  /startdir/src/znc-1.10.3/modules/modpython/generated.tar.gz
[  6%] Generating alias.fr_FR.gmo
[  6%] Built target po_adminlog_bg_BG
[  7%] Generating alias.id_ID.gmo
make[2]: *** [modules/modpython/CMakeFiles/modpython_swig.dir/build.make:74: modules/modpython/swigpyrun.h] Error 1
make[2]: *** Deleting file 'modules/modpython/swigpyrun.h'
make[1]: *** [CMakeFiles/Makefile2:4808: modules/modpython/CMakeFiles/modpython_swig.dir/all] Error 2
make[1]: *** Waiting for unfinished jobs....
[  6%] Built target po_adminlog_pl_PL
[  6%] Built target po_adminlog_el_GR
[  7%] Built target po_adminlog_it_IT
[  7%] Generating alias.it_IT.gmo
[  7%] Generating alias.pl_PL.gmo
[  7%] Generating alias.nl_NL.gmo
[  7%] Built target po_adminlog_ru_RU
[  7%] Built target po_adminlog_ro_RO
[  7%] Built target po_alias_de_DE
[  7%] Built target po_adminlog_es_ES
[  7%] Built target po_adminlog_pt_PT
[  7%] Built target po_alias_bg_BG
[  7%] Built target po_alias_el_GR
[  7%] Built target po_alias_da_DK
[  7%] Generating alias.pt_BR.gmo
[  7%] Built target po_alias_tr_TR
[  7%] Built target po_alias_es_ES
[  7%] Built target modpython_swigruntime
[  7%] Built target po_alias_id_ID
[  7%] Built target po_alias_fr_FR
[  7%] Built target modpython_functions
[  7%] Built target po_alias_pl_PL
[  7%] Built target po_alias_it_IT
[  7%] Built target po_alias_nl_NL
[  7%] Built target po_alias_pt_BR
make: *** [Makefile:136: all] Error 2
==> ERROR: A failure occurred in build().
    Aborting...
==> ERROR: Build failed, check /home/alhp/workspace/chroot/build_5c9c24d3-34e1-4527-9d21-d61dbd796c26/build
