==> Synchronizing chroot copy [/home/alhp/workspace/chroot/root] -> [build_f22fdb68-7ac5-4a3b-8eb3-a95a1870d2c2]...done
==> Making package: gping 1.21.0-1.1 (Wed Sep  2 01:51:58 2026)
==> Retrieving sources...
  -> Downloading gping-1.21.0.tar.gz...
  % Total    % Received % Xferd  Average Speed  Time    Time    Time   Current
                                 Dload  Upload  Total   Spent   Left   Speed
  0      0   0      0   0      0      0      0                              0  0      0   0      0   0      0      0      0                              0  0      0   0      0   0      0      0      0                              0
  0      0   0      0   0      0      0      0                              0100 863.5k 100 863.5k   0      0  1.43M      0                              0100 863.5k 100 863.5k   0      0  1.43M      0                              0100 863.5k 100 863.5k   0      0  1.43M      0                              0
==> Validating source files with sha512sums...
    gping-1.21.0.tar.gz ... Passed
Note: in a future version of systemd-nspawn the default set of permitted socket address families will be restricted to AF_INET, AF_INET6 and AF_UNIX. Use --restrict-address-families= to configure the set of permitted socket address families, or set RestrictAddressFamilies= in a .nspawn file.
==> Making package: gping 1.21.0-1.1 (Tue Sep  1 23:52:01 2026)
==> Checking runtime dependencies...
==> Installing missing dependencies...
resolving dependencies...
looking for conflicting packages...

Package (1)   New Version  Net Change

core/iputils  20250605-1     0.65 MiB

Total Installed Size:  0.65 MiB

:: Proceed with installation? [Y/n] 
checking keyring...
checking package integrity...
loading package files...
checking for file conflicts...
:: Processing package changes...
installing iputils...
:: Running post-transaction hooks...
(1/1) Arming ConditionNeedsUpdate...
==> Checking buildtime dependencies...
==> Installing missing dependencies...
:: There are 2 providers available for cargo:
:: Repository extra
   1) rust  2) rustup

Enter a number (default=1): 
resolving dependencies...
looking for conflicting packages...

Package (7)        New Version     Net Change

extra/compiler-rt  22.1.8-1         54.94 MiB
core/libedit       20260512_3.1-1    0.27 MiB
extra/lld          22.1.8-1          7.14 MiB
extra/llhttp       9.3.1-1           0.11 MiB
extra/llvm-libs    22.1.8-2        163.70 MiB
extra/libgit2      1:1.9.7-1         3.16 MiB
extra/rust         1:1.98.0-1      302.57 MiB

Total Installed Size:  531.89 MiB

:: Proceed with installation? [Y/n] 
checking keyring...
checking package integrity...
loading package files...
checking for file conflicts...
:: Processing package changes...
installing compiler-rt...
installing llhttp...
installing libgit2...
installing libedit...
installing llvm-libs...
installing lld...
installing rust...
Optional dependencies for rust
    gdb: rust-gdb script [installed]
    lldb: rust-lldb script
:: Running post-transaction hooks...
(1/1) Arming ConditionNeedsUpdate...
==> Retrieving sources...
  -> Found gping-1.21.0.tar.gz
==> WARNING: Skipping all source file integrity checks.
==> Extracting sources...
  -> Extracting gping-1.21.0.tar.gz with bsdtar
==> Starting prepare()...
    Updating crates.io index
 Downloading crates ...
  Downloaded quote v1.0.47
  Downloaded cfg-if v1.0.4
  Downloaded unicode-ident v1.0.24
  Downloaded cpufeatures v0.3.1
  Downloaded ntest v0.9.5
  Downloaded thiserror-impl v2.0.20
  Downloaded zerofrom v0.1.8
  Downloaded thiserror v2.0.20
  Downloaded zerovec-derive v0.11.6
  Downloaded icu_properties v2.3.0
  Downloaded lock_api v0.4.14
  Downloaded powerfmt v0.2.0
  Downloaded lazy-regex-proc_macros v3.6.1
  Downloaded stable_deref_trait v1.2.1
  Downloaded document-features v0.2.12
  Downloaded zerofrom-derive v0.1.7
  Downloaded time-core v0.1.9
  Downloaded instability v0.3.13
  Downloaded clap_lex v1.1.0
  Downloaded utf8_iter v1.0.4
  Downloaded utf8parse v0.2.2
  Downloaded anstyle-query v1.1.5
  Downloaded zerovec v0.11.8
  Downloaded equivalent v1.0.2
  Downloaded num_threads v0.1.7
  Downloaded itoa v1.0.18
  Downloaded potential_utf v0.1.6
  Downloaded ntest_test_cases v0.9.5
  Downloaded num-conv v0.2.2
  Downloaded heck v0.5.0
  Downloaded ident_case v1.0.1
  Downloaded yoke-derive v0.8.2
  Downloaded colorchoice v1.0.5
  Downloaded proc-macro-crate v3.5.0
  Downloaded rustc_version v0.4.1
  Downloaded idna_adapter v1.2.2
  Downloaded clap-cargo v0.19.0
  Downloaded roff v1.1.1
  Downloaded is_terminal_polyfill v1.70.2
  Downloaded castaway v0.2.4
  Downloaded clap_mangen v0.3.3
  Downloaded anstyle v1.0.14
  Downloaded strsim v0.11.1
  Downloaded synstructure v0.13.2
  Downloaded anstream v1.0.0
  Downloaded displaydoc v0.2.7
  Downloaded anstyle-parse v1.0.0
  Downloaded writeable v0.6.4
  Downloaded approx v0.5.1
  Downloaded tinystr v0.8.4
  Downloaded iana-time-zone v0.1.65
  Downloaded darling_macro v0.24.1
  Downloaded yoke v0.8.3
  Downloaded ntest_timeout v0.9.5
  Downloaded strum v0.28.0
  Downloaded clap_derive v4.6.4
  Downloaded litemap v0.8.3
  Downloaded convert_case v0.10.0
  Downloaded by_address v1.2.1
  Downloaded semver v1.0.28
  Downloaded clap v4.6.6
  Downloaded cfg_aliases v0.2.2
  Downloaded litrs v1.0.0
  Downloaded palette_math v0.7.7
  Downloaded icu_locale_core v2.3.0
  Downloaded icu_provider v2.3.1
  Downloaded icu_normalizer_data v2.3.0
  Downloaded zerotrie v0.2.5
  Downloaded icu_collections v2.3.0
  Downloaded derive_more v2.1.1
  Downloaded errno v0.3.14
  Downloaded signal-hook-mio v0.2.5
  Downloaded idna v1.1.0
  Downloaded scopeguard v1.2.0
  Downloaded icu_properties_data v2.3.0
  Downloaded rustversion v1.0.23
  Downloaded ratatui-crossterm v0.1.2
  Downloaded clap_builder v4.6.6
  Downloaded autocfg v1.5.1
  Downloaded either v1.18.0
  Downloaded palette_derive v0.7.7
  Downloaded static_assertions v1.1.0
  Downloaded line-clipping v0.3.8
  Downloaded chrono v0.4.45
  Downloaded toml_datetime v1.1.1+spec-1.1.0
  Downloaded rand_core v0.10.1
  Downloaded lazy-regex v3.6.1
  Downloaded icu_normalizer v2.3.0
  Downloaded foldhash v0.2.0
  Downloaded strum_macros v0.28.0
  Downloaded signal-hook-registry v1.4.8
  Downloaded os_info v3.15.0
  Downloaded deranged v0.5.8
  Downloaded chacha20 v0.10.2
  Downloaded unicode-truncate v2.0.1
  Downloaded anyhow v1.0.104
  Downloaded once_cell v1.21.4
  Downloaded lru v0.18.3
  Downloaded toml_parser v1.1.3+spec-1.1.0
  Downloaded parking_lot_core v0.9.12
  Downloaded smallvec v1.15.2
  Downloaded parking_lot v0.12.5
  Downloaded log v0.4.34
  Downloaded bitflags v2.13.1
  Downloaded kasuari v0.4.12
  Downloaded ryu v1.0.23
  Downloaded serde_derive v1.0.229
  Downloaded indoc v2.0.7
  Downloaded proc-macro2 v1.0.107
  Downloaded num-traits v0.2.19
  Downloaded allocator-api2 v0.2.21
  Downloaded getrandom v0.4.3
  Downloaded serde_core v1.0.229
  Downloaded darling v0.24.1
  Downloaded signal-hook v0.3.18
  Downloaded ratatui v0.30.2
  Downloaded toml_edit v0.25.13+spec-1.1.0
  Downloaded compact_str v0.9.1
  Downloaded serde v1.0.229
  Downloaded darling_core v0.24.1
  Downloaded rand v0.10.2
  Downloaded unicode-segmentation v1.13.3
  Downloaded indexmap v2.14.1
  Downloaded memchr v2.8.3
  Downloaded derive_more-impl v2.1.1
  Downloaded mio v1.2.2
  Downloaded hashbrown v0.16.1
  Downloaded itertools v0.14.0
  Downloaded hashbrown v0.17.1
  Downloaded libm v0.2.16
  Downloaded regex v1.13.1
  Downloaded crossterm v0.29.0
  Downloaded itertools v0.15.0
  Downloaded aho-corasick v1.1.5
  Downloaded ratatui-core v0.1.2
  Downloaded winnow v1.0.4
  Downloaded portable-atomic v1.15.0
  Downloaded syn v3.0.4
  Downloaded ratatui-widgets v0.3.2
  Downloaded syn v1.0.109
  Downloaded time v0.3.55
  Downloaded palette v0.7.7
  Downloaded unicode-width v0.2.2
  Downloaded syn v2.0.119
  Downloaded nix v0.31.3
  Downloaded regex-syntax v0.8.11
  Downloaded rustix v1.1.4
  Downloaded regex-automata v0.4.18
  Downloaded libc v0.2.189
  Downloaded linux-raw-sys v0.12.1
==> Starting build()...
   Compiling proc-macro2 v1.0.107
   Compiling unicode-ident v1.0.24
   Compiling quote v1.0.47
   Compiling stable_deref_trait v1.2.1
   Compiling libc v0.2.189
   Compiling heck v0.5.0
   Compiling smallvec v1.15.2
   Compiling equivalent v1.0.2
   Compiling foldhash v0.2.0
   Compiling rustversion v1.0.23
   Compiling allocator-api2 v0.2.21
   Compiling cfg-if v1.0.4
   Compiling thiserror v2.0.20
   Compiling bitflags v2.13.1
   Compiling strsim v0.11.1
   Compiling ident_case v1.0.1
   Compiling either v1.18.0
   Compiling utf8parse v0.2.2
   Compiling litemap v0.8.3
   Compiling parking_lot_core v0.9.12
   Compiling unicode-segmentation v1.13.3
   Compiling writeable v0.6.4
   Compiling memchr v2.8.3
   Compiling signal-hook v0.3.18
   Compiling icu_properties_data v2.3.0
   Compiling icu_normalizer_data v2.3.0
   Compiling anstyle v1.0.14
   Compiling anstyle-parse v1.0.0
   Compiling static_assertions v1.1.0
   Compiling utf8_iter v1.0.4
   Compiling regex-syntax v0.8.11
   Compiling itoa v1.0.18
   Compiling unicode-width v0.2.2
   Compiling itertools v0.14.0
   Compiling scopeguard v1.2.0
   Compiling rustix v1.1.4
   Compiling convert_case v0.10.0
   Compiling hashbrown v0.17.1
   Compiling aho-corasick v1.1.5
   Compiling hashbrown v0.16.1
   Compiling instability v0.3.13
   Compiling log v0.4.34
   Compiling ryu v1.0.23
   Compiling anstyle-query v1.1.5
   Compiling colorchoice v1.0.5
   Compiling is_terminal_polyfill v1.70.2
   Compiling lock_api v0.4.14
   Compiling clap_lex v1.1.0
   Compiling litrs v1.0.0
   Compiling castaway v0.2.4
   Compiling autocfg v1.5.1
   Compiling regex-automata v0.4.18
   Compiling lru v0.18.3
   Compiling anstream v1.0.0
   Compiling compact_str v0.9.1
   Compiling unicode-truncate v2.0.1
   Compiling syn v3.0.4
   Compiling syn v2.0.119
   Compiling errno v0.3.14
   Compiling mio v1.2.2
   Compiling indoc v2.0.7
   Compiling linux-raw-sys v0.12.1
   Compiling clap_builder v4.6.6
   Compiling line-clipping v0.3.8
   Compiling signal-hook-registry v1.4.8
   Compiling document-features v0.2.12
   Compiling num-traits v0.2.19
   Compiling once_cell v1.21.4
   Compiling parking_lot v0.12.5
   Compiling anyhow v1.0.104
   Compiling iana-time-zone v0.1.65
   Compiling roff v1.1.1
   Compiling regex v1.13.1
   Compiling itertools v0.15.0
   Compiling darling_core v0.24.1
   Compiling synstructure v0.13.2
   Compiling chrono v0.4.45
   Compiling signal-hook-mio v0.2.5
   Compiling zerofrom-derive v0.1.7
   Compiling yoke-derive v0.8.2
   Compiling strum_macros v0.28.0
   Compiling derive_more-impl v2.1.1
   Compiling lazy-regex-proc_macros v3.6.1
   Compiling zerovec-derive v0.11.6
   Compiling displaydoc v0.2.7
   Compiling thiserror-impl v2.0.20
   Compiling clap_derive v4.6.4
   Compiling lazy-regex v3.6.1
   Compiling derive_more v2.1.1
   Compiling darling_macro v0.24.1
   Compiling clap v4.6.6
   Compiling crossterm v0.29.0
   Compiling darling v0.24.1
   Compiling kasuari v0.4.12
   Compiling pinger v2.2.0 (/startdir/src/gping-1.21.0/pinger)
   Compiling zerofrom v0.1.8
   Compiling clap_mangen v0.3.3
   Compiling clap-cargo v0.19.0
   Compiling strum v0.28.0
   Compiling yoke v0.8.3
   Compiling ratatui-core v0.1.2
   Compiling zerovec v0.11.8
   Compiling zerotrie v0.2.5
   Compiling ratatui-crossterm v0.1.2
   Compiling ratatui-widgets v0.3.2
   Compiling tinystr v0.8.4
   Compiling potential_utf v0.1.6
   Compiling icu_collections v2.3.0
   Compiling icu_locale_core v2.3.0
   Compiling ratatui v0.30.2
   Compiling icu_provider v2.3.1
   Compiling icu_normalizer v2.3.0
   Compiling icu_properties v2.3.0
   Compiling idna_adapter v1.2.2
   Compiling idna v1.1.0
   Compiling gping v1.21.0 (/startdir/src/gping-1.21.0/gping)
    Finished `release` profile [optimized] target(s) in 2m 54s
==> Starting check()...
   Compiling proc-macro2 v1.0.107
   Compiling unicode-ident v1.0.24
   Compiling quote v1.0.47
   Compiling libc v0.2.189
   Compiling foldhash v0.2.0
   Compiling allocator-api2 v0.2.21
   Compiling equivalent v1.0.2
   Compiling cfg-if v1.0.4
   Compiling bitflags v2.13.1
   Compiling stable_deref_trait v1.2.1
   Compiling thiserror v2.0.20
   Compiling strsim v0.11.1
   Compiling heck v0.5.0
   Compiling log v0.4.34
   Compiling memchr v2.8.3
   Compiling unicode-segmentation v1.13.3
   Compiling regex-syntax v0.8.11
   Compiling winnow v1.0.4
   Compiling smallvec v1.15.2
   Compiling syn v1.0.109
   Compiling rustversion v1.0.23
   Compiling ident_case v1.0.1
   Compiling serde_core v1.0.229
   Compiling either v1.18.0
   Compiling toml_datetime v1.1.1+spec-1.1.0
   Compiling cfg_aliases v0.2.2
   Compiling utf8parse v0.2.2
   Compiling serde v1.0.229
   Compiling anyhow v1.0.104
   Compiling nix v0.31.3
   Compiling writeable v0.6.4
   Compiling hashbrown v0.17.1
   Compiling litemap v0.8.3
   Compiling signal-hook v0.3.18
   Compiling parking_lot_core v0.9.12
   Compiling once_cell v1.21.4
   Compiling convert_case v0.10.0
   Compiling itertools v0.14.0
   Compiling hashbrown v0.16.1
   Compiling anstyle-parse v1.0.0
   Compiling aho-corasick v1.1.5
   Compiling icu_normalizer_data v2.3.0
   Compiling static_assertions v1.1.0
   Compiling anstyle v1.0.14
   Compiling rustix v1.1.4
   Compiling scopeguard v1.2.0
   Compiling instability v0.3.13
   Compiling anstyle-query v1.1.5
   Compiling is_terminal_polyfill v1.70.2
   Compiling utf8_iter v1.0.4
   Compiling ryu v1.0.23
   Compiling unicode-width v0.2.2
   Compiling itoa v1.0.18
   Compiling icu_properties_data v2.3.0
   Compiling toml_parser v1.1.3+spec-1.1.0
   Compiling indexmap v2.14.1
   Compiling colorchoice v1.0.5
   Compiling lock_api v0.4.14
   Compiling lru v0.18.3
   Compiling linux-raw-sys v0.12.1
   Compiling clap_lex v1.1.0
   Compiling autocfg v1.5.1
   Compiling regex-automata v0.4.18
   Compiling unicode-truncate v2.0.1
   Compiling indoc v2.0.7
   Compiling litrs v1.0.0
   Compiling errno v0.3.14
   Compiling castaway v0.2.4
   Compiling compact_str v0.9.1
   Compiling anstream v1.0.0
   Compiling toml_edit v0.25.13+spec-1.1.0
   Compiling mio v1.2.2
   Compiling signal-hook-registry v1.4.8
   Compiling line-clipping v0.3.8
   Compiling syn v3.0.4
   Compiling syn v2.0.119
   Compiling parking_lot v0.12.5
   Compiling regex v1.13.1
   Compiling proc-macro-crate v3.5.0
   Compiling document-features v0.2.12
   Compiling clap_builder v4.6.6
   Compiling roff v1.1.1
   Compiling signal-hook-mio v0.2.5
   Compiling iana-time-zone v0.1.65
   Compiling itertools v0.15.0
   Compiling num-traits v0.2.19
   Compiling darling_core v0.24.1
   Compiling chrono v0.4.45
   Compiling synstructure v0.13.2
   Compiling ntest_timeout v0.9.5
   Compiling ntest_test_cases v0.9.5
   Compiling thiserror-impl v2.0.20
   Compiling zerovec-derive v0.11.6
   Compiling displaydoc v0.2.7
   Compiling darling_macro v0.24.1
   Compiling serde_derive v1.0.229
   Compiling clap_derive v4.6.4
   Compiling ntest v0.9.5
   Compiling darling v0.24.1
   Compiling zerofrom-derive v0.1.7
   Compiling yoke-derive v0.8.2
   Compiling lazy-regex-proc_macros v3.6.1
   Compiling strum_macros v0.28.0
   Compiling derive_more-impl v2.1.1
   Compiling kasuari v0.4.12
   Compiling lazy-regex v3.6.1
   Compiling pinger v2.2.0 (/startdir/src/gping-1.21.0/pinger)
   Compiling derive_more v2.1.1
   Compiling crossterm v0.29.0
   Compiling clap v4.6.6
   Compiling clap-cargo v0.19.0
   Compiling clap_mangen v0.3.3
   Compiling os_info v3.15.0
   Compiling strum v0.28.0
   Compiling zerofrom v0.1.8
   Compiling ratatui-core v0.1.2
   Compiling yoke v0.8.3
   Compiling zerovec v0.11.8
   Compiling zerotrie v0.2.5
   Compiling tinystr v0.8.4
   Compiling potential_utf v0.1.6
   Compiling icu_collections v2.3.0
   Compiling icu_locale_core v2.3.0
   Compiling ratatui-widgets v0.3.2
   Compiling ratatui-crossterm v0.1.2
   Compiling icu_provider v2.3.1
   Compiling icu_normalizer v2.3.0
   Compiling icu_properties v2.3.0
   Compiling ratatui v0.30.2
   Compiling idna_adapter v1.2.2
   Compiling idna v1.1.0
   Compiling gping v1.21.0 (/startdir/src/gping-1.21.0/gping)
    Finished `test` profile [unoptimized + debuginfo] target(s) in 1m 27s
     Running unittests src/main.rs (target/debug/deps/gping-6c93380b61bf2316)

running 18 tests
test plot_data::tests::test_jitter_empty_is_zero ... ok
test plot_data::tests::test_jitter_single_sample_is_zero ... ok
test plot_data::tests::update_drops_all_points_outside_the_buffer_window ... ok
test plot_data::tests::test_jitter_uses_chronological_order ... ok
test region_map::tests::test_host_from_foo ... ok
test region_map::tests::test_host_from_aws ... ok
test region_map::tests::test_host_from_gcp ... ok
test region_map::tests::test_invalid_input ... ok
test tests::test_a_valid_yrange_is_accepted ... ok
test tests::test_an_inverted_or_empty_yrange_is_rejected ... ok
test tests::test_automatic_y_bounds_keep_their_buffer ... ok
test tests::test_one_sided_y_bounds ... ok
test tests::test_user_supplied_y_bounds_are_used_verbatim ... ok
test tests::test_y_axis_labels_start_at_a_non_zero_minimum ... ok
test tests::test_y_axis_labels_span_the_whole_range ... ok
test tests::test_y_bounds_with_a_single_sample ... ok
test tests::test_y_bounds_without_any_data ... ok
test tests::test_y_min_pinned_above_the_data ... ok

test result: ok. 18 passed; 0 failed; 0 ignored; 0 measured; 0 filtered out; finished in 0.00s

     Running unittests src/lib.rs (target/debug/deps/pinger-cd716c71df6207e0)

running 12 tests
test test::tests::alpine ... ok
test test::tests::debian ... ok
test test::tests::dragonfly ... ok
test test::tests::macos ... ok
test test::tests::android ... ok
test test::tests::netbsd ... ok
test test::tests::openbsd ... ok
test test::tests::ubuntu ... ok
test test::tests::freebsd ... ok
test test::tests::test_integration_any ... FAILED
test test::tests::test_integration_ipv4 ... FAILED
test linux::tests::test_linux_detection ... ok

failures:

---- test::tests::test_integration_any stdout ----

thread '<unnamed>' (4917) panicked at pinger/src/test.rs:26:10:
called `Result::unwrap()` on an `Err` value: Ping exited with code: exit status: 2, stderr: ping: socktype: SOCK_RAW
ping: socket: Operation not permitted
ping: => missing cap_net_raw+p capability or setuid?

note: run with `RUST_BACKTRACE=1` environment variable to display a backtrace

---- test::tests::test_integration_ipv4 stdout ----

thread '<unnamed>' (4919) panicked at pinger/src/test.rs:36:10:
called `Result::unwrap()` on an `Err` value: Ping exited with code: exit status: 2, stderr: ping: socktype: SOCK_RAW
ping: socket: Operation not permitted
ping: => missing cap_net_raw+p capability or setuid?



failures:
    test::tests::test_integration_any
    test::tests::test_integration_ipv4

test result: FAILED. 10 passed; 2 failed; 0 ignored; 0 measured; 1 filtered out; finished in 0.01s

error: test failed, to rerun pass `-p pinger --lib`
==> ERROR: A failure occurred in check().
    Aborting...
==> ERROR: Build failed, check /home/alhp/workspace/chroot/build_f22fdb68-7ac5-4a3b-8eb3-a95a1870d2c2/build
