==> Synchronizing chroot copy [/home/alhp/workspace/chroot/root] -> [build_6707df45-79bd-4180-bad6-a8218fb38755]...done
==> Making package: python-ml-dtypes 0.6.0-1.1 (Tue Sep  1 08:47:39 2026)
==> Retrieving sources...
  -> Cloning ml_dtypes git repo...
Cloning into bare repository '/home/alhp/workspace/build/x86-64-v4/python-ml-dtypes-0.6.0-1/ml_dtypes'...
  -> Cloning python-ml-dtypes-eigen git repo...
Cloning into bare repository '/home/alhp/workspace/build/x86-64-v4/python-ml-dtypes-0.6.0-1/python-ml-dtypes-eigen'...
==> Validating source files with sha256sums...
    ml_dtypes ... Passed
    python-ml-dtypes-eigen ... Skipped
Note: in a future version of systemd-nspawn the default set of permitted socket address families will be restricted to AF_INET, AF_INET6 and AF_UNIX. Use --restrict-address-families= to configure the set of permitted socket address families, or set RestrictAddressFamilies= in a .nspawn file.
==> Making package: python-ml-dtypes 0.6.0-1.1 (Tue Sep  1 06:47:49 2026)
==> Checking runtime dependencies...
==> Installing missing dependencies...
resolving dependencies...
looking for conflicting packages...

Package (4)         New Version  Net Change

extra/blas          3.12.1-2       0.74 MiB
extra/cblas         3.12.1-2       0.34 MiB
extra/lapack        3.12.1-2      15.06 MiB
extra/python-numpy  2.5.2-1       49.24 MiB

Total Installed Size:  65.37 MiB

:: Proceed with installation? [Y/n] 
checking keyring...
checking package integrity...
loading package files...
checking for file conflicts...
:: Processing package changes...
installing blas...
installing cblas...
installing lapack...
installing python-numpy...
Optional dependencies for python-numpy
    blas-openblas: faster linear algebra
:: Running post-transaction hooks...
(1/1) Arming ConditionNeedsUpdate...
==> Checking buildtime dependencies...
==> Installing missing dependencies...
resolving dependencies...
looking for conflicting packages...

Package (23)                    New Version  Net Change

extra/cmake                     4.4.3-1      101.44 MiB
extra/cppdap                    1.58.0-3       1.61 MiB
extra/hicolor-icon-theme        0.18-1         0.05 MiB
extra/jsoncpp                   1.9.6-3        0.77 MiB
extra/libuv                     1.52.1-2       0.64 MiB
extra/ninja                     1.13.2-3       0.41 MiB
extra/perl-error                0.17030-3      0.04 MiB
extra/perl-mailtools            2.22-3         0.10 MiB
extra/perl-timedate             2.35-1         0.15 MiB
extra/python-iniconfig          2.3.0-1        0.07 MiB
extra/python-packaging          26.3-1         1.58 MiB
extra/python-pathspec           1.1.1-1        0.47 MiB
extra/python-pluggy             1.6.0-3        0.23 MiB
extra/python-pygments           2.20.0-1      15.36 MiB
extra/python-pyproject-hooks    1.2.0-6        0.11 MiB
extra/rhash                     1.4.6-1        0.34 MiB
extra/zlib-ng                   2.3.3-1        0.28 MiB
extra/git                       2.55.0-1      31.33 MiB
extra/python-absl               2.5.0-1        1.58 MiB
extra/python-build              1.6.0-1        0.33 MiB
extra/python-installer          1.0.1-1        0.21 MiB
extra/python-pytest             1:9.1.0-1      4.95 MiB
extra/python-scikit-build-core  0.12.2-1       1.83 MiB

Total Installed Size:  163.88 MiB

:: Proceed with installation? [Y/n] 
checking keyring...
checking package integrity...
loading package files...
checking for file conflicts...
:: Processing package changes...
installing python-absl...
installing python-packaging...
installing python-pyproject-hooks...
installing python-build...
Optional dependencies for python-build
    python-pip: to use as the Python package installer (default)
    python-uv: to use as the Python package installer
    python-virtualenv: to use virtualenv for build isolation
installing python-installer...
installing python-iniconfig...
installing python-pluggy...
installing python-pygments...
installing python-pytest...
installing perl-error...
installing perl-timedate...
installing perl-mailtools...
installing zlib-ng...
installing git...
Optional dependencies for git
    git-zsh-completion: upstream zsh completion
    tk: gitk and git gui
    openssh: ssh transport and crypto
    man: show help with `git command --help`
    perl-libwww: git svn
    perl-term-readkey: git svn and interactive.singlekey setting
    perl-io-socket-ssl: git send-email TLS support
    perl-authen-sasl: git send-email TLS support
    perl-cgi: gitweb (web interface) support
    python: git svn & git p4 [installed]
    subversion: git svn
    org.freedesktop.secrets: keyring credential helper
    libsecret: libsecret credential helper [installed]
    less: the default pager for git
installing cppdap...
installing hicolor-icon-theme...
installing jsoncpp...
Optional dependencies for jsoncpp
    jsoncpp-doc: documentation
installing libuv...
installing rhash...
installing cmake...
Optional dependencies for cmake
    make: for unix Makefile generator [installed]
    ninja: for ninja generator [pending]
    qt6-base: cmake-gui
installing ninja...
installing python-pathspec...
Optional dependencies for python-pathspec
    python-google-re2: re2 backend
installing python-scikit-build-core...
:: Running post-transaction hooks...
(1/3) Creating system user accounts...
Creating group 'git' with GID 969.
Creating user 'git' (git daemon user) with UID 969 and GID 969.
(2/3) Reloading system manager configuration...
  Skipped: Current root is not booted.
(3/3) Arming ConditionNeedsUpdate...
==> Retrieving sources...
==> WARNING: Skipping all source file integrity checks.
==> Extracting sources...
  -> Creating working copy of ml_dtypes git repo...
Cloning into 'ml_dtypes'...
done.
Switched to a new branch 'makepkg'
  -> Creating working copy of python-ml-dtypes-eigen git repo...
Cloning into 'python-ml-dtypes-eigen'...
done.
==> Starting prepare()...
Submodule 'third_party/eigen' (https://gitlab.com/libeigen/eigen.git) registered for path 'third_party/eigen'
Cloning into '/startdir/src/ml_dtypes/third_party/eigen'...
done.
Submodule path 'third_party/eigen': checked out 'bc3b39870ecb690a623a3f49149a358b95c5781d'
==> Starting build()...
* Getting build dependencies for wheel...
* Building wheel...
*** scikit-build-core 0.12.2 using CMake 4.4.3 (wheel)
*** Configuring CMake...
loading initial cache file /tmp/tmpw5pswd69/build/CMakeInit.txt
-- The CXX compiler identification is GNU 16.2.1
-- Detecting CXX compiler ABI info
-- Detecting CXX compiler ABI info - done
-- Check for working CXX compiler: /usr/bin/g++ - skipped
-- Detecting CXX compile features
-- Detecting CXX compile features - done
-- Found Python: /usr/bin/python (found version "3.14.7") found components: Interpreter Development.Module
CMake Warning (deprecated) at third_party/eigen/CMakeLists.txt:29 (cmake_policy):
  The OLD behavior for policy CMP0146 will be removed from a future version
  of CMake.

  The cmake-policies(7) manual explains that the OLD behaviors of all
  policies are deprecated and that a policy should be set to OLD only under
  specific short-term circumstances.  Projects should be ported to the NEW
  behavior and not rely on setting a policy to OLD.
This warning is for project developers.  Use -Wno-author or -Wno-deprecated
to suppress it.

-- The C compiler identification is GNU 16.2.1
-- Detecting C compiler ABI info
-- Detecting C compiler ABI info - done
-- Check for working C compiler: /usr/bin/gcc - skipped
-- Detecting C compile features
-- Detecting C compile features - done
-- 
-- Configured Eigen 5.0.1-dev+6bc762dd
-- 
-- Configuring done (0.7s)
-- Generating done (0.0s)
-- Build files have been written to: /tmp/tmpw5pswd69/build
*** Building project with Ninja...
[1/3] Building CXX object CMakeFiles/_ml_dtypes_ext.dir/ml_dtypes/_src/numpy.cc.o
[2/3] Building CXX object CMakeFiles/_ml_dtypes_ext.dir/ml_dtypes/_src/dtypes.cc.o
[3/3] Linking CXX shared module _ml_dtypes_ext.cpython-314-x86_64-linux-gnu.so
*** Installing project into wheel...
-- Install configuration: "Release"
-- Installing: /tmp/tmpw5pswd69/wheel/platlib/ml_dtypes/_ml_dtypes_ext.cpython-314-x86_64-linux-gnu.so
*** Making wheel...
*** Created ml_dtypes-0.0.0-cp314-cp314-linux_x86_64.whl
Successfully built ml_dtypes-0.0.0-cp314-cp314-linux_x86_64.whl
==> Starting check()...
============================= test session starts ==============================
platform linux -- Python 3.14.7, pytest-9.1.0, pluggy-1.6.0
rootdir: /startdir/src/ml_dtypes
configfile: pytest.ini
collected 4628 items

ml_dtypes/tests/custom_complex_test.py ................................. [  0%]
........................................................................ [  2%]
........................................................................ [  3%]
........................................................................ [  5%]
........................................................................ [  6%]
........................................................................ [  8%]
........................................................................ [ 10%]
........................................................................ [ 11%]
.......................................                                  [ 12%]
ml_dtypes/tests/custom_float_test.py ................................... [ 13%]
.......................................ssssss........................... [ 14%]
........................................................................ [ 16%]
........................................................................ [ 17%]
........................................................................ [ 19%]
........................................................................ [ 20%]
........................................................................ [ 22%]
...........................................................ss........... [ 24%]
........................................................................ [ 25%]
...............................................................ssssss... [ 27%]
........................................................................ [ 28%]
........................................................................ [ 30%]
........................................................................ [ 31%]
........................................................................ [ 33%]
........................................................................ [ 34%]
........................................................................ [ 36%]
........................................................................ [ 38%]
........................................................................ [ 39%]
........................................................................ [ 41%]
........................................................................ [ 42%]
........................................................................ [ 44%]
........................................................................ [ 45%]
........................................................................ [ 47%]
...............................................ss....................... [ 48%]
........................................................................ [ 50%]
........................s............................................... [ 52%]
........................................................................ [ 53%]
........................................................................ [ 55%]
.....................................                                    [ 56%]
ml_dtypes/tests/finfo_test.py .......................................... [ 56%]
......                                                                   [ 57%]
ml_dtypes/tests/iinfo_test.py ................................           [ 57%]
ml_dtypes/tests/intn_test.py ........................................... [ 58%]
........................................................................ [ 60%]
........................................................................ [ 61%]
........................................................................ [ 63%]
........................................................................ [ 64%]
........................................................................ [ 66%]
........................................................................ [ 67%]
........................................................................ [ 69%]
........................................................................ [ 71%]
........................................................................ [ 72%]
........................................................................ [ 74%]
........................................................................ [ 75%]
........................................................................ [ 77%]
........................................................................ [ 78%]
........................................................................ [ 80%]
........................................................................ [ 82%]
........................................................................ [ 83%]
........................................................................ [ 85%]
........................................................................ [ 86%]
........................................................................ [ 88%]
........................................................................ [ 89%]
........................................................................ [ 91%]
........................................................................ [ 92%]
........................................................................ [ 94%]
........................................................................ [ 96%]
........................................................................ [ 97%]
........................................................................ [ 99%]
.......................................                                  [ 99%]
ml_dtypes/tests/metadata_test.py FF                                      [100%]

=================================== FAILURES ===================================
____________ CustomFloatTest.test_version_matches_package_metadata _____________

self = <metadata_test.CustomFloatTest testMethod=test_version_matches_package_metadata>

    def test_version_matches_package_metadata(self):
      try:
        ml_dtypes_metadata = metadata.metadata("ml_dtypes")
      except ImportError as err:
        raise absltest.SkipTest("Package metadata not found") from err
    
      metadata_version = ml_dtypes_metadata["version"]
      package_version = ml_dtypes.__version__
>     self.assertEqual(metadata_version, package_version)
E     AssertionError: 
E     - 0.0.0
E     ?   ^
E     + 0.6.0
E     ?   ^

ml_dtypes/tests/metadata_test.py:33: AssertionError
_____ CustomFloatTest.test_version_matches_package_metadata_multi_threaded _____

self = <metadata_test.CustomFloatTest testMethod=test_version_matches_package_metadata_multi_threaded>

    def test_version_matches_package_metadata(self):
      try:
        ml_dtypes_metadata = metadata.metadata("ml_dtypes")
      except ImportError as err:
        raise absltest.SkipTest("Package metadata not found") from err
    
      metadata_version = ml_dtypes_metadata["version"]
      package_version = ml_dtypes.__version__
>     self.assertEqual(metadata_version, package_version)
E     AssertionError: 
E     - 0.0.0
E     ?   ^
E     + 0.6.0
E     ?   ^

ml_dtypes/tests/metadata_test.py:33: AssertionError
=========================== short test summary info ============================
FAILED ml_dtypes/tests/metadata_test.py::CustomFloatTest::test_version_matches_package_metadata
FAILED ml_dtypes/tests/metadata_test.py::CustomFloatTest::test_version_matches_package_metadata_multi_threaded
================== 2 failed, 4609 passed, 17 skipped in 6.72s ==================
==> ERROR: A failure occurred in check().
    Aborting...
==> ERROR: Build failed, check /home/alhp/workspace/chroot/build_6707df45-79bd-4180-bad6-a8218fb38755/build
