==> Synchronizing chroot copy [/home/alhp/workspace/chroot/root] -> [build_3bad3e08-cfc6-42bb-b2eb-92721dc9287e]...done
==> Making package: rink 0.9.0-1.1 (Sun Aug 30 23:55:01 2026)
==> Retrieving sources...
  -> Cloning rink-rs git repo...
Cloning into bare repository '/home/alhp/workspace/build/x86-64-v4/rink-0.9.0-1/rink-rs'...
==> Validating source files with b2sums...
    rink-rs ... Passed
==> Verifying source file signatures with gpg...
    rink-rs git repo ... Passed
Note: in a future version of systemd-nspawn the default set of permitted socket address families will be restricted to AF_INET, AF_INET6 and AF_UNIX. Use --restrict-address-families= to configure the set of permitted socket address families, or set RestrictAddressFamilies= in a .nspawn file.
==> Making package: rink 0.9.0-1.1 (Sun Aug 30 21:55:09 2026)
==> Checking runtime dependencies...
==> Checking buildtime dependencies...
==> Installing missing dependencies...
resolving dependencies...
looking for conflicting packages...

Package (16)          New Version     Net Change

extra/compiler-rt     22.1.8-1         54.94 MiB
core/libedit          20260512_3.1-1    0.27 MiB
extra/libgit2         1:1.9.7-1         3.16 MiB
extra/libyaml         0.2.5-3           0.18 MiB
extra/lld             22.1.8-1          7.14 MiB
extra/llhttp          9.3.1-1           0.11 MiB
extra/llvm-libs       22.1.8-2        163.70 MiB
extra/perl-error      0.17030-3         0.04 MiB
extra/perl-mailtools  2.22-3            0.10 MiB
extra/perl-timedate   2.35-1            0.15 MiB
extra/ruby            3.4.10-1         16.96 MiB
extra/rubygems        3.6.9-1           2.73 MiB
extra/zlib-ng         2.3.3-1           0.28 MiB
extra/asciidoctor     2.0.26-1          1.88 MiB
extra/git             2.55.0-1         31.33 MiB
extra/rust            1:1.98.0-1      302.57 MiB

Total Installed Size:  585.54 MiB

:: Proceed with installation? [Y/n] 
checking keyring...
checking package integrity...
loading package files...
checking for file conflicts...
:: Processing package changes...
installing libyaml...
installing rubygems...
installing ruby...
Optional dependencies for ruby
    tk: for Ruby/TK
    ruby-docs: Documentation for Ruby
    ruby-default-gems: Default gems which are part of Ruby StdLib
    ruby-bundled-gems: Bundled gems which are part of Ruby StdLib
    ruby-stdlib: Full Ruby StdLib including default gems, bundled gems and tools
installing asciidoctor...
installing perl-error...
installing perl-timedate...
installing perl-mailtools...
installing zlib-ng...
installing git...
Optional dependencies for git
    git-zsh-completion: upstream zsh completion
    tk: gitk and git gui
    openssh: ssh transport and crypto
    man: show help with `git command --help`
    perl-libwww: git svn
    perl-term-readkey: git svn and interactive.singlekey setting
    perl-io-socket-ssl: git send-email TLS support
    perl-authen-sasl: git send-email TLS support
    perl-cgi: gitweb (web interface) support
    python: git svn & git p4 [installed]
    subversion: git svn
    org.freedesktop.secrets: keyring credential helper
    libsecret: libsecret credential helper [installed]
    less: the default pager for git
installing compiler-rt...
installing llhttp...
installing libgit2...
installing libedit...
installing llvm-libs...
installing lld...
installing rust...
Optional dependencies for rust
    gdb: rust-gdb script [installed]
    lldb: rust-lldb script
:: Running post-transaction hooks...
(1/3) Creating system user accounts...
Creating group 'git' with GID 969.
Creating user 'git' (git daemon user) with UID 969 and GID 969.
(2/3) Reloading system manager configuration...
  Skipped: Current root is not booted.
(3/3) Arming ConditionNeedsUpdate...
==> Retrieving sources...
==> WARNING: Skipping all source file integrity checks.
==> Extracting sources...
  -> Creating working copy of rink-rs git repo...
Cloning into 'rink-rs'...
done.
Switched to a new branch 'makepkg'
==> Starting prepare()...
    Updating crates.io index
 Downloading crates ...
  Downloaded ubyte v0.10.4
  Downloaded unicode-ident v1.0.12
  Downloaded serde_derive v1.0.219
  Downloaded quote v1.0.40
  Downloaded serde v1.0.219
  Downloaded smallvec v1.13.2
  Downloaded humantime-serde v1.1.1
  Downloaded equivalent v1.0.1
  Downloaded tokio-macros v2.3.0
  Downloaded crossbeam-utils v0.8.19
  Downloaded async-lock v2.8.0
  Downloaded scopeguard v1.2.0
  Downloaded async-io v1.13.0
  Downloaded toml_datetime v0.6.5
  Downloaded cfg-if v1.0.0
  Downloaded event-listener v2.5.3
  Downloaded atomic-waker v1.1.2
  Downloaded chunked_transfer v1.5.0
  Downloaded strsim v0.10.0
  Downloaded cfg_aliases v0.2.1
  Downloaded futures-sink v0.3.30
  Downloaded event-listener v4.0.3
  Downloaded lazy_static v1.4.0
  Downloaded fd-lock v3.0.13
  Downloaded openssl-macros v0.1.1
  Downloaded autocfg v1.2.0
  Downloaded normalize-line-endings v0.3.0
  Downloaded num_cpus v1.16.0
  Downloaded assert-json-diff v2.0.2
  Downloaded thiserror-impl v1.0.59
  Downloaded piper v0.2.1
  Downloaded event-listener-strategy v0.5.1
  Downloaded encoding_index_tests v0.1.4
  Downloaded foreign-types v0.3.2
  Downloaded socket2 v0.4.10
  Downloaded ctrlc v3.4.7
  Downloaded openssl-probe v0.1.5
  Downloaded itoa v1.0.11
  Downloaded futures-task v0.3.30
  Downloaded wait-timeout v0.2.1
  Downloaded futures-core v0.3.30
  Downloaded foreign-types-shared v0.1.1
  Downloaded futures-io v0.3.30
  Downloaded predicates-core v1.0.9
  Downloaded wasm-bindgen-shared v0.2.92
  Downloaded dirs-sys v0.3.7
  Downloaded fastrand v2.0.2
  Downloaded utf8parse v0.2.1
  Downloaded similar-asserts v1.5.0
  Downloaded async-channel v2.2.1
  Downloaded async-global-executor v2.4.1
  Downloaded pin-utils v0.1.0
  Downloaded futures-macro v0.3.30
  Downloaded httpdate v1.0.3
  Downloaded endian-type v0.1.2
  Downloaded indenter v0.3.3
  Downloaded anstyle-query v1.0.2
  Downloaded parking v2.2.0
  Downloaded serde_spanned v0.6.5
  Downloaded fastrand v1.9.0
  Downloaded parking_lot_core v0.9.10
  Downloaded pin-project-lite v0.2.14
  Downloaded signal-hook-registry v1.4.2
  Downloaded async-channel v1.9.0
  Downloaded predicates-tree v1.0.12
  Downloaded wasm-bindgen-macro v0.2.92
  Downloaded errno v0.3.13
  Downloaded dirs v1.0.5
  Downloaded lock_api v0.4.12
  Downloaded memoffset v0.6.5
  Downloaded termtree v0.5.1
  Downloaded bincode v1.3.3
  Downloaded num-integer v0.1.46
  Downloaded clap_lex v0.7.0
  Downloaded encoding-index-singlebyte v1.20141219.5
  Downloaded thiserror v1.0.59
  Downloaded pkg-config v0.3.30
  Downloaded difflib v0.4.0
  Downloaded tokio-native-tls v0.3.1
  Downloaded futures-channel v0.3.30
  Downloaded waker-fn v1.1.1
  Downloaded num-rational v0.4.1
  Downloaded event-listener-strategy v0.4.0
  Downloaded wee_alloc v0.4.5
  Downloaded wasm-bindgen-test-macro v0.3.42
  Downloaded iana-time-zone v0.1.60
  Downloaded dirs v4.0.0
  Downloaded strsim v0.11.1
  Downloaded cfg-if v0.1.10
  Downloaded memory_units v0.4.0
  Downloaded colorchoice v1.0.0
  Downloaded pin-project-internal v1.1.5
  Downloaded wasm-bindgen-futures v0.4.42
  Downloaded futures-executor v0.3.30
  Downloaded kv-log-macro v1.0.7
  Downloaded nibble_vec v0.1.0
  Downloaded parking_lot v0.12.2
  Downloaded scoped-tls v1.0.1
  Downloaded blocking v1.5.1
  Downloaded async-executor v1.11.0
  Downloaded assert_cmd v2.0.17
  Downloaded float-cmp v0.10.0
  Downloaded bitflags v2.5.0
  Downloaded console v0.15.8
  Downloaded slab v0.4.9
  Downloaded humantime v2.1.0
  Downloaded value-bag v1.8.1
  Downloaded tokio-stream v0.1.15
  Downloaded wasm-bindgen-backend v0.2.92
  Downloaded doc-comment v0.3.3
  Downloaded log v0.4.21
  Downloaded wasm-bindgen-test v0.3.42
  Downloaded predicates v3.1.3
  Downloaded ryu v1.0.17
  Downloaded once_cell v1.19.0
  Downloaded native-tls v0.2.11
  Downloaded wasm-bindgen-macro-support v0.2.92
  Downloaded nu-ansi-term v0.50.0
  Downloaded concurrent-queue v2.4.0
  Downloaded toml v0.8.12
  Downloaded socket2 v0.5.6
  Downloaded bitflags v1.3.2
  Downloaded proc-macro2 v1.0.95
  Downloaded anstyle-parse v0.2.3
  Downloaded serde-wasm-bindgen v0.6.5
  Downloaded anstyle v1.0.6
  Downloaded bytes v1.6.0
  Downloaded unicode-width v0.1.11
  Downloaded irc v1.0.0
  Downloaded similar v2.5.0
  Downloaded num-traits v0.2.18
  Downloaded irc-proto v1.0.0
  Downloaded futures-lite v2.3.0
  Downloaded async-lock v3.3.0
  Downloaded event-listener v5.3.0
  Downloaded anstream v0.6.13
  Downloaded io-lifetimes v1.0.11
  Downloaded tempfile v3.10.1
  Downloaded tracing-core v0.1.32
  Downloaded pin-project v1.1.5
  Downloaded ascii v1.1.0
  Downloaded cc v1.0.95
  Downloaded futures-lite v1.13.0
  Downloaded tracing v0.1.40
  Downloaded toml v0.7.8
  Downloaded async-io v2.3.2
  Downloaded tiny_http v0.12.0
  Downloaded eyre v0.6.12
  Downloaded futures v0.3.30
  Downloaded indexmap v2.2.6
  Downloaded polling v2.8.0
  Downloaded async-task v4.7.0
  Downloaded clap_builder v4.5.2
  Downloaded polling v3.7.0
  Downloaded encoding-index-japanese v1.20141219.5
  Downloaded toml v0.5.11
  Downloaded clap v4.5.4
  Downloaded openssl-sys v0.9.109
  Downloaded jiff-static v0.2.15
  Downloaded memchr v2.7.2
  Downloaded mio v0.8.11
  Downloaded unicode-segmentation v1.11.0
  Downloaded tokio-util v0.7.10
  Downloaded encoding v0.2.33
  Downloaded num-bigint v0.4.4
  Downloaded toml_edit v0.19.15
  Downloaded regex-automata v0.1.10
  Downloaded toml_edit v0.22.12
  Downloaded encoding-index-korean v1.20141219.5
  Downloaded encoding-index-tradchinese v1.20141219.5
  Downloaded encoding-index-simpchinese v1.20141219.5
  Downloaded bumpalo v3.16.0
  Downloaded js-sys v0.3.69
  Downloaded winnow v0.6.7
  Downloaded hashbrown v0.14.3
  Downloaded curl v0.4.46
  Downloaded serde_json v1.0.116
  Downloaded futures-util v0.3.30
  Downloaded winnow v0.5.40
  Downloaded rustyline v9.1.2
  Downloaded syn v2.0.104
  Downloaded chrono v0.4.38
  Downloaded vcpkg v0.2.15
  Downloaded openssl v0.10.73
  Downloaded aho-corasick v1.1.3
  Downloaded bstr v0.2.17
  Downloaded nix v0.30.1
  Downloaded wasm-bindgen v0.2.92
  Downloaded async-std v1.12.0
  Downloaded console_error_panic_hook v0.1.7
  Downloaded radix_trie v0.2.1
  Downloaded nix v0.23.2
  Downloaded jiff v0.2.15
  Downloaded tokio v1.38.2
  Downloaded libc v0.2.174
  Downloaded regex v1.11.1
  Downloaded rustix v0.37.27
  Downloaded regex-syntax v0.8.5
  Downloaded rustix v0.38.34
  Downloaded bstr v1.12.0
  Downloaded regex-automata v0.4.9
  Downloaded linux-raw-sys v0.3.8
  Downloaded linux-raw-sys v0.4.13
  Downloaded curl-sys v0.4.72+curl-8.6.0
  Downloaded libz-sys v1.1.16
==> Starting build()...
RINK_PATH=/usr/share/rink cargo build --locked --offline --no-default-features --release -p rink
asciidoctor -b manpage -D build ./docs/rink.1.adoc
asciidoctor -b manpage -D build ./docs/rink.5.adoc
   Compiling autocfg v1.2.0
   Compiling proc-macro2 v1.0.95
   Compiling unicode-ident v1.0.12
   Compiling libc v0.2.174
   Compiling pkg-config v0.3.30
   Compiling cc v1.0.95
   Compiling serde v1.0.219
   Compiling vcpkg v0.2.15
   Compiling bitflags v2.5.0
   Compiling cfg-if v1.0.0
   Compiling utf8parse v0.2.1
   Compiling cfg_aliases v0.2.1
   Compiling rustix v0.38.34
   Compiling linux-raw-sys v0.4.13
   Compiling anstyle-query v1.0.2
   Compiling serde_json v1.0.116
   Compiling anstyle v1.0.6
   Compiling smallvec v1.13.2
   Compiling colorchoice v1.0.0
   Compiling hashbrown v0.14.3
   Compiling equivalent v1.0.1
   Compiling clap_lex v0.7.0
   Compiling ryu v1.0.17
   Compiling itoa v1.0.11
   Compiling nix v0.30.1
   Compiling curl v0.4.46
   Compiling anstyle-parse v0.2.3
   Compiling bitflags v1.3.2
   Compiling endian-type v0.1.2
asciidoctor -b manpage -D build ./docs/rink.7.adoc
   Compiling strsim v0.11.1
   Compiling nibble_vec v0.1.0
   Compiling eyre v0.6.12
   Compiling anstream v0.6.13
   Compiling humantime v2.1.0
   Compiling radix_trie v0.2.1
   Compiling openssl-probe v0.1.5
   Compiling unicode-width v0.1.11
   Compiling log v0.4.21
   Compiling jiff v0.2.15
asciidoctor -b manpage -D build ./docs/rink-defs.5.adoc
   Compiling indenter v0.3.3
   Compiling once_cell v1.19.0
   Compiling memchr v2.7.2
   Compiling fastrand v2.0.2
   Compiling clap_builder v4.5.2
   Compiling unicode-segmentation v1.11.0
   Compiling strsim v0.10.0
   Compiling nu-ansi-term v0.50.0
asciidoctor -b manpage -D build ./docs/rink-dates.5.adoc
   Compiling indexmap v2.2.6
   Compiling quote v1.0.40
   Compiling syn v2.0.104
   Compiling num-traits v0.2.18
   Compiling num-bigint v0.4.4
   Compiling memoffset v0.6.5
   Compiling num-rational v0.4.1
   Compiling dirs-sys v0.3.7
   Compiling nix v0.23.2
   Compiling socket2 v0.5.6
   Compiling fd-lock v3.0.13
   Compiling tempfile v3.10.1
   Compiling dirs v4.0.0
   Compiling num-integer v0.1.46
   Compiling clap v4.5.4
   Compiling ctrlc v3.4.7
   Compiling rustyline v9.1.2
   Compiling libz-sys v1.1.16
   Compiling openssl-sys v0.9.109
   Compiling curl-sys v0.4.72+curl-8.6.0
   Compiling serde_derive v1.0.219
   Compiling bincode v1.3.3
   Compiling humantime-serde v1.1.1
   Compiling ubyte v0.10.4
   Compiling toml v0.5.11
   Compiling rink-sandbox v0.9.0 (/startdir/src/rink-rs/sandbox)
   Compiling rink-core v0.9.0 (/startdir/src/rink-rs/core)
   Compiling rink v0.9.0 (/startdir/src/rink-rs/cli)
    Finished `release` profile [optimized] target(s) in 1m 20s
==> Starting check()...
   Compiling autocfg v1.2.0
   Compiling libc v0.2.174
   Compiling proc-macro2 v1.0.95
   Compiling unicode-ident v1.0.12
   Compiling pkg-config v0.3.30
   Compiling serde v1.0.219
   Compiling cc v1.0.95
   Compiling vcpkg v0.2.15
   Compiling cfg-if v1.0.0
   Compiling bitflags v2.5.0
   Compiling memchr v2.7.2
   Compiling cfg_aliases v0.2.1
   Compiling rustix v0.38.34
   Compiling utf8parse v0.2.1
   Compiling anstyle v1.0.6
   Compiling linux-raw-sys v0.4.13
   Compiling unicode-segmentation v1.11.0
   Compiling colorchoice v1.0.0
   Compiling smallvec v1.13.2
   Compiling serde_json v1.0.116
   Compiling regex-syntax v0.8.5
   Compiling anstyle-query v1.0.2
   Compiling itoa v1.0.11
   Compiling eyre v0.6.12
   Compiling equivalent v1.0.1
   Compiling log v0.4.21
   Compiling anstyle-parse v0.2.3
   Compiling hashbrown v0.14.3
   Compiling nix v0.30.1
   Compiling clap_lex v0.7.0
   Compiling ryu v1.0.17
   Compiling nibble_vec v0.1.0
   Compiling strsim v0.11.1
   Compiling curl v0.4.46
   Compiling anstream v0.6.13
   Compiling endian-type v0.1.2
   Compiling bitflags v1.3.2
   Compiling indenter v0.3.3
   Compiling once_cell v1.19.0
   Compiling unicode-width v0.1.11
   Compiling doc-comment v0.3.3
   Compiling openssl-probe v0.1.5
   Compiling predicates-core v1.0.9
   Compiling strsim v0.10.0
   Compiling fastrand v2.0.2
   Compiling humantime v2.1.0
   Compiling radix_trie v0.2.1
   Compiling jiff v0.2.15
   Compiling normalize-line-endings v0.3.0
   Compiling termtree v0.5.1
   Compiling clap_builder v4.5.2
   Compiling difflib v0.4.0
   Compiling quote v1.0.40
   Compiling nu-ansi-term v0.50.0
   Compiling lazy_static v1.4.0
   Compiling assert_cmd v2.0.17
   Compiling predicates-tree v1.0.12
   Compiling num-traits v0.2.18
   Compiling syn v2.0.104
   Compiling num-bigint v0.4.4
   Compiling memoffset v0.6.5
   Compiling aho-corasick v1.1.3
   Compiling num-rational v0.4.1
   Compiling indexmap v2.2.6
   Compiling similar v2.5.0
   Compiling httpdate v1.0.3
   Compiling chunked_transfer v1.5.0
   Compiling ascii v1.1.0
   Compiling num-integer v0.1.46
   Compiling float-cmp v0.10.0
   Compiling tiny_http v0.12.0
   Compiling dirs-sys v0.3.7
   Compiling nix v0.23.2
   Compiling socket2 v0.5.6
   Compiling console v0.15.8
   Compiling wait-timeout v0.2.1
   Compiling dirs v4.0.0
   Compiling similar-asserts v1.5.0
   Compiling regex-automata v0.4.9
   Compiling clap v4.5.4
   Compiling fd-lock v3.0.13
   Compiling tempfile v3.10.1
   Compiling rustyline v9.1.2
   Compiling ctrlc v3.4.7
   Compiling regex v1.11.1
   Compiling bstr v1.12.0
   Compiling predicates v3.1.3
   Compiling openssl-sys v0.9.109
   Compiling libz-sys v1.1.16
   Compiling curl-sys v0.4.72+curl-8.6.0
   Compiling serde_derive v1.0.219
   Compiling bincode v1.3.3
   Compiling humantime-serde v1.1.1
   Compiling toml v0.5.11
   Compiling ubyte v0.10.4
   Compiling rink-sandbox v0.9.0 (/startdir/src/rink-rs/sandbox)
   Compiling rink-core v0.9.0 (/startdir/src/rink-rs/core)
   Compiling rink v0.9.0 (/startdir/src/rink-rs/cli)
    Finished `test` profile [unoptimized + debuginfo] target(s) in 1m 21s
     Running unittests src/lib.rs (target/debug/deps/rink-7a97de64b0060f4a)

running 0 tests

test result: ok. 0 passed; 0 failed; 0 ignored; 0 measured; 0 filtered out; finished in 0.00s

     Running unittests src/main.rs (target/debug/deps/rink-906054498d0f95b1)

running 0 tests

test result: ok. 0 passed; 0 failed; 0 ignored; 0 measured; 0 filtered out; finished in 0.00s

     Running tests/cli_args.rs (target/debug/deps/cli_args-ecfaf87a8c5d3575)

running 4 tests
test test_invalid ... ok
test test_config_path ... ok
test test_version ... ok
test test_help ... ok

test result: ok. 4 passed; 0 failed; 0 ignored; 0 measured; 0 filtered out; finished in 0.09s

     Running tests/cli_eval.rs (target/debug/deps/cli_eval-608c8cfeb6903548)

running 5 tests
test test_invalid_config ... ok
test test_invalid_expr ... ok
test test_run_file ... ok
test test_with_config ... ok
test test_run_stdin ... ok

test result: ok. 5 passed; 0 failed; 0 ignored; 0 measured; 0 filtered out; finished in 0.14s

     Running tests/fmt_test.rs (target/debug/deps/fmt_test-c259490de3bbda60)

running 1 test
test test_to_ansi ... ok

test result: ok. 1 passed; 0 failed; 0 ignored; 0 measured; 0 filtered out; finished in 0.05s

     Running tests/http_test.rs (target/debug/deps/http_test-6c532573c459b754)

running 7 tests
test test_download_404 ... ok
test test_run_with_currency_503 ... FAILED
test test_download_success ... FAILED
test test_force_refresh_success ... FAILED
test test_run_with_currency ... FAILED
test test_force_refresh_timeout ... FAILED
test test_download_timeout ... FAILED

failures:

---- test_run_with_currency_503 stdout ----

thread 'test_run_with_currency_503' (4211) panicked at library/core/src/ops/function.rs:250:5:
Unexpected stdout, failed var.starts_with("Failed to fetch http://127.0.0.1:3090/data/currency.json: Received status 503 while downloading http://127.0.0.1:3090/data/currency.json\n457.2 millimeter (length)\nFinished in")
├── var: > Download currency data from <http://127.0.0.1:3090/data/currency.json>? [y/n] Failed to fetch http://127.0.0.1:3090/data/currency.json: Received status 503 while downloading http://127.0.0.1:3090/data/currency.json
│   > 457.2 millimeter (length)
│   Finished in 114.978µs using 3020K of memory
│   > 
└── var as str: > Download currency data from <http://127.0.0.1:3090/data/currency.json>? [y/n] Failed to fetch http://127.0.0.1:3090/data/currency.json: Received status 503 while downloading http://127.0.0.1:3090/data/currency.json
    > 457.2 millimeter (length)
    Finished in 114.978µs using 3020K of memory
    > 

command=`NO_COLOR="true" "/startdir/src/rink-rs/target/debug/rink" "-c" "tests/config_sandboxed_local_server.toml"`
stdin=````
$
y
1.5 feet
```
`
code=0
stdout=```
> Download currency data from <http://127.0.0.1:3090/data/currency.json>? [y/n] Failed to fetch http://127.0.0.1:3090/data/currency.json: Received status 503 while downloading http://127.0.0.1:3090/data/currency.json
> 457.2 millimeter (length)
Finished in 114.978µs using 3020K of memory
> ```

stderr=""

note: run with `RUST_BACKTRACE=1` environment variable to display a backtrace

---- test_download_success stdout ----

thread 'test_download_success' (4206) panicked at cli/tests/http_test.rs:70:32:
called `Result::unwrap()` on an `Err` value: PoisonError { .. }

---- test_force_refresh_success stdout ----

thread 'test_force_refresh_success' (4208) panicked at cli/tests/http_test.rs:111:32:
called `Result::unwrap()` on an `Err` value: PoisonError { .. }

---- test_run_with_currency stdout ----

thread 'test_run_with_currency' (4210) panicked at cli/tests/http_test.rs:158:32:
called `Result::unwrap()` on an `Err` value: PoisonError { .. }

---- test_force_refresh_timeout stdout ----

thread 'test_force_refresh_timeout' (4209) panicked at cli/tests/http_test.rs:141:32:
called `Result::unwrap()` on an `Err` value: PoisonError { .. }

---- test_download_timeout stdout ----

thread 'test_download_timeout' (4207) panicked at cli/tests/http_test.rs:19:32:
called `Result::unwrap()` on an `Err` value: PoisonError { .. }


failures:
    test_download_success
    test_download_timeout
    test_force_refresh_success
    test_force_refresh_timeout
    test_run_with_currency
    test_run_with_currency_503

test result: FAILED. 1 passed; 6 failed; 0 ignored; 0 measured; 0 filtered out; finished in 0.16s

error: test failed, to rerun pass `--test http_test`
==> ERROR: A failure occurred in check().
    Aborting...
==> ERROR: Build failed, check /home/alhp/workspace/chroot/build_3bad3e08-cfc6-42bb-b2eb-92721dc9287e/build
